Monocesium monoxide
- Formula: CsO
- Molecular weight: 148.9049
- IUPAC Standard InChIKey: VSUDBQBZSQOTNU-UHFFFAOYSA-N
- CAS Registry Number: 24774-39-8
- Chemical structure:
View 3d structure (requires JavaScript / HTML 5) - Permanent link for this species. Use this link for bookmarking this species for future reference.

Gas phase thermochemistry data

Quantity | Value | Units | Method | Reference | Comment |
---|---|---|---|---|---|
ΔfH°gas | 62.76 | kJ/mol | Review | Chase, 1998 | Data last reviewed in December, 1968 |
Quantity | Value | Units | Method | Reference | Comment |
S°gas,1 bar | 255.54 | J/mol*K | Review | Chase, 1998 | Data last reviewed in December, 1968 |
Gas Phase Heat Capacity (Shomate Equation)
Cp° = A + B*t + C*t2 + D*t3 +
E/t2
H° − H°298.15= A*t + B*t2/2 +
C*t3/3 + D*t4/4 − E/t + F − H
S° = A*ln(t) + B*t + C*t2/2 + D*t3/3 −
E/(2*t2) + G
Cp = heat capacity (J/mol*K)
H° = standard enthalpy (kJ/mol)
S° = standard entropy (J/mol*K)
t = temperature (K) / 1000.
View plot Requires a JavaScript / HTML 5 canvas capable browser.
Temperature (K) | 298. to 6000. |
---|---|
A | 37.37178 |
B | 0.778914 |
C | -0.009963 |
D | 0.000849 |
E | -0.100457 |
F | 51.24647 |
G | 299.9694 |
H | 62.76000 |
Reference | Chase, 1998 |
Comment | Data last reviewed in December, 1968 |

Gas phase ion energetics data

Data compiled as indicated in comments:
LBLHLM - Sharon G. Lias, John E. Bartmess, Joel F. Liebman, John L. Holmes, Rhoda D. Levin, and W. Gary Mallard
Ionization energy determinations
IE (eV) | Method | Reference | Comment |
---|---|---|---|
6.22 | S | Butman, Kudin, et al., 1984 | LBLHLM |

References

Chase, 1998
Chase, M.W., Jr.,
NIST-JANAF Themochemical Tables, Fourth Edition,
J. Phys. Chem. Ref. Data, Monograph 9, 1998, 1-1951. [all data]
Butman, Kudin, et al., 1984
Butman, M.F.; Kudin, L.S.; Krasnov, K.S.,
The Mass-spectrometric determination of the proton affinity of the molecules M2O (M = Na, K, Rb, Cs),
Russ. J. Inorg. Chem., 1984, 29, 1228, In original 2150. [all data]