Benzenamine, N,N'-1,2-ethanediylidenebis[4-methoxy-
- Formula: C16H16N2O2
- Molecular weight: 268.3104
- IUPAC Standard InChIKey: IRMGPOUTEGABKC-UHFFFAOYSA-N
- CAS Registry Number: 24764-91-8
- Chemical structure:
View 3d structure (requires JavaScript / HTML 5) - Other names: Benzenamine, N,N'-1,2-ethanediylidenebis*4-methoxy-; N,N'-Ethanediylidenebis[4-methoxybenzenamine]

Gas phase ion energetics data

Data compiled by: Sharon G. Lias, John E. Bartmess, Joel F. Liebman, John L. Holmes, Rhoda D. Levin, and W. Gary Mallard
Ionization energy determinations
IE (eV) | Method | Reference | Comment |
---|---|---|---|
7.1 | PE | Guimon, Pfister-Guillouzo, et al., 1985 | |
7.75 | PE | Guimon, Pfister-Guillouzo, et al., 1985 | Vertical value |

References

Guimon, Pfister-Guillouzo, et al., 1985
Guimon, C.; Pfister-Guillouzo, G.; Chaudret, B.; Poilblanc, R.,
Application of photoelectron spectroscopy to molecular properties. Part 19. Electronic atructure of tris(α-di-imino) complexes of ruthenium(0),
J. Chem. Soc. Dalton Trans., 1985, 43. [all data]