1,2,5-Thia(s(iv))diazole,3,4-dihydro-3-methyl-
- Formula: C3H6N2S
- Molecular weight: 102.158
- CAS Registry Number: 24692-43-1

Gas phase ion energetics data

Data compiled by: Sharon G. Lias, Rhoda D. Levin, and Sherif A. Kafafi
Ionization energy determinations
IE (eV) | Method | Reference | Comment |
---|---|---|---|
8.92 | PE | Kroner, Strack, et al., 1973 | Vertical value |

References

Kroner, Strack, et al., 1973
Kroner, J.; Strack, W.; Holsboer, F.; Kosbahn, W.,
Zur elektronenstruktur der thiokumulene,
Z. Naturforsch. B:, 1973, 28, 188. [all data]