1H-Imidazole, 1-acetyl-
- Formula: C5H6N2O
- Molecular weight: 110.1139
- IUPAC Standard InChIKey: VIHYIVKEECZGOU-UHFFFAOYSA-N
- CAS Registry Number: 2466-76-4
- Chemical structure:
View 3d structure (requires JavaScript / HTML 5) - Other names: Imidazole, 1-acetyl-; Acetylimidazole; N-Acetylimidazole; 1-Acetylimidazole; Imidazole, N-acetyl-; 1-Acetyl-1H-imidazole

Reaction thermochemistry data

Data compiled by: Hussein Y. Afeefy, Joel F. Liebman, and Stephen E. Stein
Individual Reactions
By formula: C5H6N2O + H2O = C3H4N2 + C2H4O2
Quantity | Value | Units | Method | Reference | Comment |
---|---|---|---|---|---|
ΔrH° | -20.2 ± 0.2 | kJ/mol | Cm | Wadso, 1960 | liquid phase; solvent: Aqueous; Heat of hydrolysis |
By formula: C4H11N + C5H6N2O = C6H13NO + C3H4N2
Quantity | Value | Units | Method | Reference | Comment |
---|---|---|---|---|---|
ΔrH° | -75.6 ± 0.3 | kJ/mol | Cm | Wadso, 1962 | solid phase |

Gas phase ion energetics data

Data compiled by: Sharon G. Lias, Rhoda D. Levin, and Sherif A. Kafafi
Ionization energy determinations
IE (eV) | Method | Reference | Comment |
---|---|---|---|
9.38 | PE | Ramsey, 1979 | Vertical value |

Van Den Dool and Kratz RI, non-polar column, temperature ramp

Column type | Active phase | I | Reference | Comment |
---|---|---|---|---|
Capillary | VF-5MS | 1054. | Todua, 2011 | 30. m/0.25 mm/0.25 μm, He; Tstart: 60. C; Tend: 270. C |

References

Wadso, 1960
Wadso, I.,
Heats of hydrolysis of N-acetylated imidazole, 1,2,4-triazole and tetrazole,
Acta Chem. Scand., 1960, 14, 903-908. [all data]
Wadso, 1962
Wadso, I.,
Heats of aminolysis and hydrolysis of some N-acetyl compounds and of acetic anhydride,
Acta Chem. Scand., 1962, 16, 471-478. [all data]
Ramsey, 1979
Ramsey, B.G.,
Substituent effects on imidazole basicity and photoelectron spectroscopy determined ionization energies,
J. Org. Chem., 1979, 44, 2093. [all data]