1,3-Benzodithiole,2-(1,3-benzodithiol-2-ylidene)-
- Formula: C14H8S4
- Molecular weight: 304.473
- IUPAC Standard InChIKey: OVIRUXIWCFZJQC-UHFFFAOYSA-N
- CAS Registry Number: 24648-13-3
- Chemical structure:
View 3d structure (requires JavaScript / HTML 5) - Permanent link for this species. Use this link for bookmarking this species for future reference.

Gas phase ion energetics data

Data compiled by: Sharon G. Lias, Rhoda D. Levin, and Sherif A. Kafafi
Ionization energy determinations
IE (eV) | Method | Reference | Comment |
---|---|---|---|
6.68 | PE | Sato, Seki, et al., 1981 | |
6.81 | PE | Spanget-Larsen, Gleiter, et al., 1976 | Vertical value |

References

Sato, Seki, et al., 1981
Sato, N.; Seki, K.; Inokuchi, H.,
Polarization energies of organic solids determined by ultraviolet photoelectron spectroscopy,
J. Chem. Soc. Faraday Trans. 2, 1981, 77, 1621. [all data]
Spanget-Larsen, Gleiter, et al., 1976
Spanget-Larsen, J.; Gleiter, R.; Hunig, S.,
The electronic structure of dibenzotetrathiafulvalene,
Chem. Phys. Lett., 1976, 37, 29. [all data]