Trimethylantimony dibromide
- Formula: C3H9Br2Sb
- Molecular weight: 326.672
- IUPAC Standard InChIKey: HGGPVCKBWYYOBU-UHFFFAOYSA-L
- CAS Registry Number: 24606-08-4
- Chemical structure:
View 3d structure (requires JavaScript / HTML 5) - Species with the same structure:

Gas phase ion energetics data

Data compiled by: Sharon G. Lias, Rhoda D. Levin, and Sherif A. Kafafi
Ionization energy determinations
IE (eV) | Method | Reference | Comment |
---|---|---|---|
9.57 | PE | Elbel and tom Dieck, 1981 | Vertical value |

References

Elbel and tom Dieck, 1981
Elbel, S.; tom Dieck, H.,
Die stiborane Me3SbX2 (X = Me, Cl, Br, I) und SbCl5 - im vergleich mit nebengruppenanaloga TaMe5, TaCl5 und NbCl5,
Z. Anorg. Allg. Chem., 1981, 483, 33. [all data]