Pyridine, 3,5-dichloro-
- Formula: C5H3Cl2N
- Molecular weight: 147.990
- IUPAC Standard InChIKey: WPGHPGAUFIJVJF-UHFFFAOYSA-N
- CAS Registry Number: 2457-47-8
- Chemical structure:
View 3d structure (requires JavaScript / HTML 5) - Other names: 3,5-Dichloropyridine

Phase change data

Data compiled by: William E. Acree, Jr., James S. Chickos
Quantity | Value | Units | Method | Reference | Comment |
---|---|---|---|---|---|
ΔsubH° | 67.3 ± 1.9 | kJ/mol | C | Ribeiro da Silva, 1997 |

Gas phase ion energetics data

Data compiled by: Sharon G. Lias, Rhoda D. Levin, and Sherif A. Kafafi
Ionization energy determinations
IE (eV) | Method | Reference | Comment |
---|---|---|---|
9.88 | PE | Ramsey and Walker, 1974 | Vertical value |

References

Ribeiro da Silva, 1997
Ribeiro da Silva, M.,
Standard molar enthalpies of formation of 2- and 3-bromopyridine and of 2,5- and 2,6-dibromopyridine,
The Journal of Chemical Thermodynamics, 1997, 29, 12, 1545-1551, https://doi.org/10.1006/jcht.1997.0268
. [all data]
Ramsey and Walker, 1974
Ramsey, B.G.; Walker, F.A.,
A linear relationship between substituted pyridine lone pair vertical ionization potentials and pKa,
J. Am. Chem. Soc., 1974, 96, 3314. [all data]