Cyclopentane, 1,3-dimethyl-
- Formula: C7H14
- Molecular weight: 98.1861
- IUPAC Standard InChIKey: XAZKFISIRYLAEE-UHFFFAOYSA-N
- CAS Registry Number: 2453-00-1
- Chemical structure:
View 3d structure (requires JavaScript / HTML 5) - Stereoisomers:
- Other names: 1,3-Dimethylcyclopentane

Condensed phase thermochemistry data

Data compiled by: Hussein Y. Afeefy, Joel F. Liebman, and Stephen E. Stein
Quantity | Value | Units | Method | Reference | Comment |
---|---|---|---|---|---|
ΔcH°liquid | -4599.9 | kJ/mol | Ccb | Zubova, 1901 | Corresponding ΔfHºliquid = -156. kJ/mol (simple calculation by NIST; no Washburn corrections) |

Phase change data

Data compiled by: Thermodynamics Research Center, NIST Boulder Laboratories, Chris Muzny director
Quantity | Value | Units | Method | Reference | Comment |
---|---|---|---|---|---|
Tboil | 364.33 | K | N/A | Boord, Greenlee, et al., 1950 | Uncertainty assigned by TRC = 0.8 K |
Tboil | 364.20 | K | N/A | Boord, Henne, et al., 1949 | Uncertainty assigned by TRC = 0.5 K |
Tboil | 366. | K | N/A | Zelinskii, 1897 | Uncertainty assigned by TRC = 6. K |
Quantity | Value | Units | Method | Reference | Comment |
Tfus | 132.6 | K | N/A | Boord, Henne, et al., 1949 | Uncertainty assigned by TRC = 0.5 K |
Tfus | 132.6 | K | N/A | Perilstein, 1945 | Uncertainty assigned by TRC = 2. K |
Tfus | 136.5 | K | N/A | Timmermans, 1927 | Uncertainty assigned by TRC = 3. K |

Gas phase ion energetics data

Data compiled by: Sharon G. Lias and Joel F. Liebman
Ionization energy determinations
IE (eV) | Method | Reference |
---|---|---|
9.56 ± 0.05 | EI | Holmes and Lossing, 1991 |

Normal alkane RI, non-polar column, temperature ramp

Column type | Active phase | I | Reference | Comment |
---|---|---|---|---|
Capillary | SE-54 | 678. | Guan, Li, et al., 1995 | 60. C @ 2. min, 4. K/min; Column length: 50. m; Column diameter: 0.32 mm; Tend: 200. C |
Capillary | DB-1 | 682. | Ciccioli, Cecinato, et al., 1992 | 60. m/0.32 mm/1.2 μm, He, 30. C @ 10. min, 3. K/min; Tend: 240. C |

Normal alkane RI, non-polar column, custom temperature program

Column type | Active phase | I | Reference | Comment |
---|---|---|---|---|
Capillary | Squalane | 690. | Chen, 2008 | Program: not specified |
Capillary | Squalane | 681. | Chen, 2008 | Program: not specified |
Capillary | Squalane | 698. | Chen, 2008 | Program: not specified |
Capillary | Methyl Silicone | 674. | Xu, Chu, et al., 1995 | Program: not specified |

References

Zubova, 1901
Zubova, P.,
Data about heat of combustion of compound cycle structure,
Zh. Fiz. Khim., 1901, 33, 708-722. [all data]
Boord, Greenlee, et al., 1950
Boord, C.E.; Greenlee, K.W.; Derfer, J.M.,
The Synthesis, Purification and Prop. of Hydrocarbons of Low Mol. Wt., Am. Pet. Inst. Res. Proj. 45, Twelfth Annu. Rep., Ohio State Univ., 1950. [all data]
Boord, Henne, et al., 1949
Boord, C.E.; Henne, A.L.; Greenlee, K.W.; Perilstein, W.L.; Derfer, J.M.,
The Grignard Reagent in hydrocarbon synthesis,
Ind. Eng. Chem., 1949, 41, 609. [all data]
Zelinskii, 1897
Zelinskii, N.D.,
Experiments in the Hexamethylene Series,
Ber. Dtsch. Chem. Ges., 1897, 30, 387-91. [all data]
Perilstein, 1945
Perilstein, W.L.,
, Am. Pet. Inst. Res. Proj. 45, Ohio State Univ., 1945. [all data]
Timmermans, 1927
Timmermans, J.,
The Melting Point of Organic Substances,
Bull. Soc. Chim. Belg., 1927, 36, 502. [all data]
Holmes and Lossing, 1991
Holmes, J.L.; Lossing, F.P.,
Ionization energies of homologous organic compounds and correlation with molecular size,
Org. Mass Spectrom., 1991, 26, 537. [all data]
Guan, Li, et al., 1995
Guan, Y.; Li, L.; Zhou, L.,
Live retention database for compound identification in capillary gas chromatography,
Chin. J. Chromatogr., 1995, 13, 5, 851-857. [all data]
Ciccioli, Cecinato, et al., 1992
Ciccioli, P.; Cecinato, A.; Brancaleoni, E.; Frattoni, M.; Liberti, A.,
Use of carbon adsorption traps combined with high resolution gas chromatography - mass spectrometry for the analysis of polar and non-polar C4-C14 hydrocarbons involved in photochemical smog formation,
J. Hi. Res. Chromatogr., 1992, 15, 2, 75-84, https://doi.org/10.1002/jhrc.1240150205
. [all data]
Chen, 2008
Chen, H.-F.,
Quantitative prediction of gas chromatography retention indices with support vector machines, radial basis neutral networks and multiple linear regression,
Anal. Chim. Acta, 2008, 609, 1, 24-36, https://doi.org/10.1016/j.aca.2008.01.003
. [all data]
Xu, Chu, et al., 1995
Xu, X.; Chu, S.; Song, N.,
Application of chromatographic studies of air pollution in China,
J. Chromatogr. A, 1995, 710, 1, 21-37, https://doi.org/10.1016/0021-9673(95)00173-K
. [all data]