Propargylamine
- Formula: C3H5N
- Molecular weight: 55.0785
- IUPAC Standard InChIKey: JKANAVGODYYCQF-UHFFFAOYSA-N
- CAS Registry Number: 2450-71-7
- Chemical structure:
View 3d structure (requires JavaScript / HTML 5) - Other names: 2-Propyn-1-amine; 3-Amino-1-propyne; 2-Propynylamine; 3-Aminoprop-1-yne; 3-Aminopropyne; 1-Propine, 3-amino-; Prop-2-ynylamine; NSC 80642

Condensed phase thermochemistry data

Data compiled by: Hussein Y. Afeefy, Joel F. Liebman, and Stephen E. Stein
Quantity | Value | Units | Method | Reference | Comment |
---|---|---|---|---|---|
ΔfH°liquid | 206. ± 0.8 | kJ/mol | Ccb | Shirokikh, Bystrov, et al., 1966 | |
Quantity | Value | Units | Method | Reference | Comment |
ΔcH°liquid | -2100.8 ± 0.84 | kJ/mol | Ccb | Shirokikh, Bystrov, et al., 1966 | Reanalyzed by Cox and Pilcher, 1970, Original value = -2101. ± 0.8 kJ/mol |

Phase change data

Data compiled by: Robert L. Brown and Stephen E. Stein
Quantity | Value | Units | Method | Reference | Comment |
---|---|---|---|---|---|
Tboil | 356.2 | K | N/A | Weast and Grasselli, 1989 | |
Tboil | 354. to 356. | K | N/A | Buckingham and Donaghy, 1982 |

Gas phase ion energetics data

Data evaluated as indicated in comments:
HL - Edward P. Hunter and Sharon G. Lias
Data compiled as indicated in comments:
LL - Sharon G. Lias and Joel F. Liebman
Quantity | Value | Units | Method | Reference | Comment |
---|---|---|---|---|---|
Proton affinity (review) | 887.4 | kJ/mol | N/A | Hunter and Lias, 1998 | HL |
Quantity | Value | Units | Method | Reference | Comment |
Gas basicity | 853.5 | kJ/mol | N/A | Hunter and Lias, 1998 | HL |
Appearance energy determinations
Ion | AE (eV) | Other Products | Method | Reference | Comment |
---|---|---|---|---|---|
CH3N+ | 10.70 ± 0.05 | C2H2 | EI | Holmes, Lossing, et al., 1992 | LL |

References

Shirokikh, Bystrov, et al., 1966
Shirokikh, P.K.; Bystrov, V.M.; Ponomarev, V.V.; Solntsev, V.A.,
Heats of combustion and enthalpies of formation of certain acetylenic amines,
Russ. J. Phys. Chem. (Engl. Transl.), 1966, 40, 894-895. [all data]
Cox and Pilcher, 1970
Cox, J.D.; Pilcher, G.,
Thermochemistry of Organic and Organometallic Compounds, Academic Press, New York, 1970, 1-636. [all data]
Weast and Grasselli, 1989
CRC Handbook of Data on Organic Compounds, 2nd Editon, Weast,R.C and Grasselli, J.G., ed(s)., CRC Press, Inc., Boca Raton, FL, 1989, 1. [all data]
Buckingham and Donaghy, 1982
Buckingham, J.; Donaghy, S.M.,
Dictionary of Organic Compounds: Fifth Edition, Chapman and Hall, New York, 1982, 1. [all data]
Hunter and Lias, 1998
Hunter, E.P.; Lias, S.G.,
Evaluated Gas Phase Basicities and Proton Affinities of Molecules: An Update,
J. Phys. Chem. Ref. Data, 1998, 27, 3, 413-656, https://doi.org/10.1063/1.556018
. [all data]
Holmes, Lossing, et al., 1992
Holmes, J.L.; Lossing, F.P.; Mayer, P.M.,
Concerning the heats of formation of CH2NH and CH2NH+,
Chem. Phys. Lett., 1992, 198, 211. [all data]