Spiro[4.4]nona-1,3,7-triene
- Formula: C9H10
- Molecular weight: 118.1757
- IUPAC Standard InChIKey: QWUJRJVGSSNVCN-UHFFFAOYSA-N
- CAS Registry Number: 24430-29-3
- Chemical structure:
View 3d structure (requires JavaScript / HTML 5) - Permanent link for this species. Use this link for bookmarking this species for future reference.

Gas phase ion energetics data

Data compiled as indicated in comments:
LLK - Sharon G. Lias, Rhoda D. Levin, and Sherif A. Kafafi
Ionization energy determinations
IE (eV) | Method | Reference | Comment |
---|---|---|---|
8.2 | PE | Batich, Heilbronner, et al., 1974 | LLK |
8.25 | PE | Batich, Heilbronner, et al., 1974 | Vertical value; LLK |

References

Batich, Heilbronner, et al., 1974
Batich, C.; Heilbronner, E.; Rommel, E.; Semmelhack, M.F.; Foos, J.S.,
Equivalence of the energy gaps {DELTA}I(1,2) and {DELTA}E(1,2) between corresponding bands in the photoelectron (I) and electronic absorption (E) spectra of spiro[4.4]nonatetraene. An amusing consequence of spiroconjugation,
J. Am. Chem. Soc., 1974, 96, 7662. [all data]