N,N-Dimethyl-β-naphthylamine
- Formula: C12H13N
- Molecular weight: 171.2383
- IUPAC Standard InChIKey: IKZPRXHVTFNIEK-UHFFFAOYSA-N
- CAS Registry Number: 2436-85-3
- Chemical structure:
View 3d structure (requires JavaScript / HTML 5) - Other names: 2-Naphthalenamine, N,N-dimethyl-; dimethyl(2-naphthyl)amine

Phase change data

Data compiled as indicated in comments:
BS - Robert L. Brown and Stephen E. Stein
TRC - Thermodynamics Research Center, NIST Boulder Laboratories, Chris Muzny director
Quantity | Value | Units | Method | Reference | Comment |
---|---|---|---|---|---|
Tboil | 578.2 | K | N/A | Weast and Grasselli, 1989 | BS |
Tboil | 486.15 | K | N/A | Perkin, 1896 | Uncertainty assigned by TRC = 1. K; TRC |

Gas phase ion energetics data

Data compiled by: Sharon G. Lias, Rhoda D. Levin, and Sherif A. Kafafi
Ionization energy determinations
IE (eV) | Method | Reference | Comment |
---|---|---|---|
7.12 | PE | Utsunomiya, Kobayashi, et al., 1975 | Vertical value |

References

Weast and Grasselli, 1989
CRC Handbook of Data on Organic Compounds, 2nd Editon, Weast,R.C and Grasselli, J.G., ed(s)., CRC Press, Inc., Boca Raton, FL, 1989, 1. [all data]
Perkin, 1896
Perkin, W.H.,
LXIX. On Magnetic Rotatory Power, especially of Aromatic Compounds,
J. Chem. Soc., 1896, 69, 1025-1257. [all data]
Utsunomiya, Kobayashi, et al., 1975
Utsunomiya, C.; Kobayashi, T.; Nagakura, S.,
Photoelectron spectra of substituted naphthalenes,
Bull. Chem. Soc. Jpn., 1975, 48, 1852. [all data]