2,3,4-Hexatriene, 2,5-dimethyl-
- Formula: C8H12
- Molecular weight: 108.1809
- IUPAC Standard InChIKey: SOESISOWJSWAJZ-UHFFFAOYSA-N
- CAS Registry Number: 2431-31-4
- Chemical structure:

Gas phase ion energetics data

Data compiled by: Sharon G. Lias, Rhoda D. Levin, and Sherif A. Kafafi
Ionization energy determinations
IE (eV) | Method | Reference |
---|---|---|
7.70 | PE | Brogli, Heilbronner, et al., 1974 |

References

Brogli, Heilbronner, et al., 1974
Brogli, F.; Heilbronner, E.; Kloster-Jensen, E.; Schmelzer, A.; Manocha, A.S.; Pople, J.A.; Radom, L.,
The photoelectron spectrum of butatriene,
Chem. Phys., 1974, 4, 107. [all data]