4-(4-Tolyl)butanoic acid methyl ester
- Formula: C12H16O2
- Molecular weight: 192.2542
- IUPAC Standard InChIKey: RWYCVUAUOUCQAN-UHFFFAOYSA-N
- CAS Registry Number: 24306-23-8
- Chemical structure:
View 3d structure (requires JavaScript / HTML 5) - Permanent link for this species. Use this link for bookmarking this species for future reference.

Gas phase ion energetics data

Data compiled by: Henry M. Rosenstock, Keith Draxl, Bruce W. Steiner, and John T. Herron
Ionization energy determinations
IE (eV) | Method | Reference |
---|---|---|
8.5 ± 0.2 | EI | Howe, Williams, et al., 1969 |
Appearance energy determinations
Ion | AE (eV) | Other Products | Method | Reference | Comment |
---|---|---|---|---|---|
C3H6O2+ | 11.5 ± 0.2 | ? | EI | Howe, Williams, et al., 1969 | |
C8H9+ | 12.5 ± 0.2 | ? | EI | Howe, Williams, et al., 1969 | |
C9H10+ | 10.7 ± 0.2 | ? | EI | Howe, Williams, et al., 1969 | |
C11H12O+ | 9.5 ± 0.2 | CH3OH | EI | Howe, Williams, et al., 1969 | |
C11H13O+ | 11.2 ± 0.2 | CH3O | EI | Howe, Williams, et al., 1969 |

References

Howe, Williams, et al., 1969
Howe, I.; Williams, D.H.; Kingston, D.G.I.; Tannenbaum, H.P.,
Substituent effects in the mass spectra of some - and -substituted methyl butyrates,
J. Chem. Soc. B, 1969, 439. [all data]