Methyl-d1 radical, oxo-
- Formula: CDO
- Molecular weight: 30.0242
- IUPAC Standard InChIKey: CFHIDWOYWUOIHU-MICDWDOJSA-N
- CAS Registry Number: 24286-05-3
- Chemical structure:
View 3d structure (requires JavaScript / HTML 5) - Isotopologues:

Gas phase ion energetics data

Data compiled as indicated in comments:
LLK - Sharon G. Lias, Rhoda D. Levin, and Sherif A. Kafafi
B - John E. Bartmess
Electron affinity determinations
EA (eV) | Method | Reference | Comment |
---|---|---|---|
0.3009 ± 0.0050 | LPES | Murray, Miller, et al., 1986 | B |
Ionization energy determinations
IE (eV) | Method | Reference | Comment |
---|---|---|---|
8.56 ± 0.01 | PE | Dyke, Jonathan, et al., 1980 | LLK |

References

Murray, Miller, et al., 1986
Murray, K.K.; Miller, T.M.; Leopold, D.G.; Lineberger, W.C.,
Laser photoelectron spectroscopy of the Formylf anion,
J. Chem. Phys., 1986, 84, 2520. [all data]
Dyke, Jonathan, et al., 1980
Dyke, J.M.; Jonathan, N.B.H.; Morris, A.; Winter, M.J.,
The first ionization potential of the formyl radical, HCO(X2A'), studied using photoelectron spectroscopy,
Mol. Phys., 1980, 39, 629. [all data]