Methyl 3-(1,1'-biphenyl-4-yl)butanoate
- Formula: C17H18O2
- Molecular weight: 254.3236
- IUPAC Standard InChIKey: CRQARNDWPSBDKT-UHFFFAOYSA-N
- CAS Registry Number: 24254-67-9
- Chemical structure:
View 3d structure (requires JavaScript / HTML 5) - Other names: 3-(4-Biphenylyl)butanoic acid methyl ester

Gas phase ion energetics data

Data compiled by: Henry M. Rosenstock, Keith Draxl, Bruce W. Steiner, and John T. Herron
Ionization energy determinations
IE (eV) | Method | Reference |
---|---|---|
8.0 ± 0.2 | EI | Howe, Williams, et al., 1969 |
Appearance energy determinations
Ion | AE (eV) | Other Products | Method | Reference | Comment |
---|---|---|---|---|---|
C14H13+ | 10.9 ± 0.2 | ? | EI | Howe, Williams, et al., 1969 | |
C15H14+ | 9.9 ± 0.2 | ? | EI | Howe, Williams, et al., 1969 |

References

Howe, Williams, et al., 1969
Howe, I.; Williams, D.H.; Kingston, D.G.I.; Tannenbaum, H.P.,
Substituent effects in the mass spectra of some - and -substituted methyl butyrates,
J. Chem. Soc. B, 1969, 439. [all data]