Hydrocinnamic acid, β-methyl-p-nitro-, methyl ester
- Formula: C11H13NO4
- Molecular weight: 223.2252
- IUPAC Standard InChIKey: LGXBWSXGLXOQDJ-UHFFFAOYSA-N
- CAS Registry Number: 24254-61-3
- Chemical structure:
View 3d structure (requires JavaScript / HTML 5) - Other names: Methyl 3-(4-nitrophenyl)butanoate; 3-(4-Nitrophenyl)butanoic acid methyl ester

Gas phase ion energetics data

Data compiled by: Henry M. Rosenstock, Keith Draxl, Bruce W. Steiner, and John T. Herron
Appearance energy determinations
Ion | AE (eV) | Other Products | Method | Reference | Comment |
---|---|---|---|---|---|
C8H8NO2+ | 11.6 ± 0.2 | ? | EI | Howe, Williams, et al., 1969 | |
C9H9NO2+ | 9.5 ± 0.2 | ? | EI | Howe, Williams, et al., 1969 | |
C10H10NO3+ | 11.1 ± 0.2 | CH3O | EI | Howe, Williams, et al., 1969 |

References

Howe, Williams, et al., 1969
Howe, I.; Williams, D.H.; Kingston, D.G.I.; Tannenbaum, H.P.,
Substituent effects in the mass spectra of some - and -substituted methyl butyrates,
J. Chem. Soc. B, 1969, 439. [all data]