4-(4-Phenoxyphenyl)butanoic acid methyl ester
- Formula: C17H18O3
- Molecular weight: 270.3230
- IUPAC Standard InChIKey: VTGLGZNRGWSTHU-UHFFFAOYSA-N
- CAS Registry Number: 24254-59-9
- Chemical structure:
View 3d structure (requires JavaScript / HTML 5) - Permanent link for this species. Use this link for bookmarking this species for future reference.

Gas phase ion energetics data

Data compiled by: Henry M. Rosenstock, Keith Draxl, Bruce W. Steiner, and John T. Herron
Ionization energy determinations
IE (eV) | Method | Reference |
---|---|---|
7.9 ± 0.2 | EI | Howe, Williams, et al., 1969 |
Appearance energy determinations
Ion | AE (eV) | Other Products | Method | Reference | Comment |
---|---|---|---|---|---|
C3H6O2+ | 11.2 ± 0.2 | ? | EI | Howe, Williams, et al., 1969 | |
C13H11O+ | 11.3 ± 0.2 | ? | EI | Howe, Williams, et al., 1969 | |
C14H12O+ | 10.5 ± 0.2 | ? | EI | Howe, Williams, et al., 1969 | |
C16H15O2+ | 11.2 ± 0.2 | CH3O | EI | Howe, Williams, et al., 1969 |

References

Howe, Williams, et al., 1969
Howe, I.; Williams, D.H.; Kingston, D.G.I.; Tannenbaum, H.P.,
Substituent effects in the mass spectra of some - and -substituted methyl butyrates,
J. Chem. Soc. B, 1969, 439. [all data]