3-Pentyl hydroperoxide
- Formula: C5H12O2
- Molecular weight: 104.1476
- IUPAC Standard InChIKey: RLBQWRSRDVXRTJ-UHFFFAOYSA-N
- CAS Registry Number: 24254-57-7
- Chemical structure:
View 3d structure (requires JavaScript / HTML 5) - Permanent link for this species. Use this link for bookmarking this species for future reference.

Gas phase ion energetics data

Data compiled by: Henry M. Rosenstock, Keith Draxl, Bruce W. Steiner, and John T. Herron
Appearance energy determinations
Ion | AE (eV) | Other Products | Method | Reference | Comment |
---|---|---|---|---|---|
C5H11+ | 10.9 ± 0.1 | ? | EI | Burgess, SenSharma, et al., 1968 | |
C5H11O+ | 10.2 ± 0.1 | OH | EI | Burgess, SenSharma, et al., 1968 | |
C5H11O2+ | 10.8 ± 0.1 | H | EI | Burgess, SenSharma, et al., 1968 |

References

Burgess, SenSharma, et al., 1968
Burgess, A.R.; SenSharma, D.K.; White, M.J.D.,
The mass spectrometry of some alkyl peroxy radicals and related alkyl hydroperoxides,
Advan. Mass Spectrom., 1968, 4, 345. [all data]