Hydroperoxide, 1-methylpentyl
- Formula: C6H14O2
- Molecular weight: 118.1742
- IUPAC Standard InChIKey: XWXUHAUZCICPHE-UHFFFAOYSA-N
- CAS Registry Number: 24254-55-5
- Chemical structure:
View 3d structure (requires JavaScript / HTML 5) - Species with the same structure:
- Other names: 2-Hexyl hydroperoxide; 1-Methylpentyl hydroperoxide; n-C4H9CH(CH3)OOH; 2-Hydroperoxyhexane

Condensed phase thermochemistry data

Data compiled by: Hussein Y. Afeefy, Joel F. Liebman, and Stephen E. Stein
Quantity | Value | Units | Method | Reference | Comment |
---|---|---|---|---|---|
ΔcH°liquid | -4052. ± 3. | kJ/mol | Ccb | Pritzkow and Muller, 1956 | Corresponding ΔfHºliquid = -310. kJ/mol (simple calculation by NIST; no Washburn corrections) |

Gas phase ion energetics data

Data compiled as indicated in comments:
LLK - Sharon G. Lias, Rhoda D. Levin, and Sherif A. Kafafi
RDSH - Henry M. Rosenstock, Keith Draxl, Bruce W. Steiner, and John T. Herron
Ionization energy determinations
IE (eV) | Method | Reference | Comment |
---|---|---|---|
9.25 ± 0.03 | PE | Ashmore and Burgess, 1977 | LLK |
9.96 | PE | Ashmore and Burgess, 1977 | Vertical value; LLK |
Appearance energy determinations
Ion | AE (eV) | Other Products | Method | Reference | Comment |
---|---|---|---|---|---|
C6H13+ | 10.0 ± 0.1 | ? | EI | Burgess, SenSharma, et al., 1968 | RDSH |
C6H13O+ | 9.7 ± 0.1 | OH | EI | Burgess, SenSharma, et al., 1968 | RDSH |
C6H13O2+ | 9.6 ± 0.1 | H | EI | Burgess, SenSharma, et al., 1968 | RDSH |

References

Pritzkow and Muller, 1956
Pritzkow, W.; Muller, K.A.,
Uber die energetische stellung der organischen hydroperoxyde und die o-o-bindungsenergie,
Chem. Ber., 1956, 89, 2318-2321. [all data]
Ashmore and Burgess, 1977
Ashmore, F.S.; Burgess, A.R.,
Study of Some Medium Size Alcohols and Hydroperoxides by Photoelectron Spectroscopy,
J. Chem. Soc. Faraday Trans. 2, 1977, 73, 1247. [all data]
Burgess, SenSharma, et al., 1968
Burgess, A.R.; SenSharma, D.K.; White, M.J.D.,
The mass spectrometry of some alkyl peroxy radicals and related alkyl hydroperoxides,
Advan. Mass Spectrom., 1968, 4, 345. [all data]