Pyrazine, 1,4-dioxide
- Formula: C4H4N2O2
- Molecular weight: 112.0868
- IUPAC Standard InChIKey: SXTKIFFXFIDYJF-UHFFFAOYSA-N
- CAS Registry Number: 2423-84-9
- Chemical structure:
View 3d structure (requires JavaScript / HTML 5) - Other names: Pyrazine di-N-oxide; Pyrazine dioxide; Pyrazine N,N'-dioxide

Gas phase thermochemistry data

Data compiled as indicated in comments:
ALS - Hussein Y. Afeefy, Joel F. Liebman, and Stephen E. Stein
Quantity | Value | Units | Method | Reference | Comment |
---|---|---|---|---|---|
ΔfH°gas | 152. | kJ/mol | Semi | Stewart, 2004 | |
ΔfH°gas | 186.5 ± 1.9 | kJ/mol | Ccb | Acree, Powell, et al., 1997 | ALS |

Condensed phase thermochemistry data

Data compiled by: Hussein Y. Afeefy, Joel F. Liebman, and Stephen E. Stein
Quantity | Value | Units | Method | Reference | Comment |
---|---|---|---|---|---|
ΔfH°solid | 116.9 ± 0.8 | kJ/mol | Ccb | Acree, Powell, et al., 1997 | |
Quantity | Value | Units | Method | Reference | Comment |
ΔcH°solid | -2215.3 ± 1.6 | kJ/mol | Ccb | Acree, Powell, et al., 1997 |

Phase change data

Data compiled as indicated in comments:
TRC - Thermodynamics Research Center, NIST Boulder Laboratories, Chris Muzny director
ALS - Hussein Y. Afeefy, Joel F. Liebman, and Stephen E. Stein
AC - William E. Acree, Jr., James S. Chickos
Quantity | Value | Units | Method | Reference | Comment |
---|---|---|---|---|---|
Tfus | 574. | K | N/A | Thornton, Verhoeven, et al., 1990 | Uncertainty assigned by TRC = 4. K; TRC |
Quantity | Value | Units | Method | Reference | Comment |
ΔsubH° | 69.6 ± 1.7 | kJ/mol | C | Acree, Powell, et al., 1997 | ALS |
ΔsubH° | 116.9 ± 0.8 | kJ/mol | C | Acree, Powell, et al., 1997 | AC |

Gas phase ion energetics data

Data compiled by: Sharon G. Lias, Rhoda D. Levin, and Sherif A. Kafafi
Ionization energy determinations
IE (eV) | Method | Reference | Comment |
---|---|---|---|
8.33 ± 0.02 | PE | Maier, Muller, et al., 1975 | Vertical value |

References

Stewart, 2004
Stewart, J.J.P.,
Comparison of the accuracy of semiempirical and some DFT methods for predicting heats of formation,
J. Mol. Model, 2004, 10, 1, 6-10, https://doi.org/10.1007/s00894-003-0157-6
. [all data]
Acree, Powell, et al., 1997
Acree, W.E., Jr.; Powell, J.R.; Tucker, S.A.; Ribeiro da Silva, M.D.M.C.; Matos, M.A.R.; Goncalves, J.M.; Santos, L.M.N.B.F.; Morais, V.M.F.; Pilcher, G.,
Thermochemical and theroretical study of some quinoxaline 1,4-dioxides and pyrazine 1,4-dioxide,
J. Org. Chem., 1997, 62, 3722-3726. [all data]
Thornton, Verhoeven, et al., 1990
Thornton, D.A.; Verhoeven, P.F.M.; Watkins, G.M.; Desseyn, H.O.; Van Der Veken, B.J.,
Isotope labeling studies of some aromatic N-oxides-I. A full vibrational assignment of the infrared and Raman spectra (4000-50 cm-1) of pyrazine N, N'-dioxide and its fully deuterated analog,
Spectrochim. Acta, Part A, 1990, 46, 1439-51. [all data]
Maier, Muller, et al., 1975
Maier, J.P.; Muller, J.-F.; Kubota, T.,
182. Ionisation energies and the electronic structures of the N-oxides of diazabenzenes,
Helv. Chim. Acta, 1975, 58, 1634. [all data]