Quindoxin
- Formula: C8H6N2O2
- Molecular weight: 162.1454
- IUPAC Standard InChIKey: CKIHZSGJPSDCNC-UHFFFAOYSA-N
- CAS Registry Number: 2423-66-7
- Chemical structure:
View 3d structure (requires JavaScript / HTML 5) - Other names: Quinoxaline, 1,4-dioxide; Bayo N-Ox; BAY-Va 9391; Celbar; Grofas; ICI 8173; Quinoxaline di-N-oxide; Quinoxaline dioxide; Quinoxaline 1,4-di-N-oxide; USAF H-1; Chindoxin; Chinoxalin-1,4-dioxid; NSC 193508; NSC 21653

Gas phase ion energetics data

Data compiled by: Sharon G. Lias, Rhoda D. Levin, and Sherif A. Kafafi
Ionization energy determinations
IE (eV) | Method | Reference | Comment |
---|---|---|---|
7.98 ± 0.05 | PE | Maier, Muller, et al., 1975 | Vertical value |

References

Maier, Muller, et al., 1975
Maier, J.P.; Muller, J.-F.; Kubota, T.; Yamakawa, M.,
183. Ionisation energies and the electronic structures of the N-oxides of azanaphthalenes and azaanthracenes,
Helv. Chim. Acta, 1975, 58, 1641. [all data]