Bicyclo[3.2.0]hepta-2,6-diene
- Formula: C7H8
- Molecular weight: 92.1384
- IUPAC Standard InChIKey: PZWQRDVVVKIYLX-UHFFFAOYSA-N
- CAS Registry Number: 2422-86-8
- Chemical structure:
View 3d structure (requires JavaScript / HTML 5) - Permanent link for this species. Use this link for bookmarking this species for future reference.

Gas phase thermochemistry data

Data compiled by: Hussein Y. Afeefy, Joel F. Liebman, and Stephen E. Stein
Quantity | Value | Units | Method | Reference | Comment |
---|---|---|---|---|---|
ΔfH°gas | 264. | kJ/mol | Chyd | Roth, Adamczak, et al., 1991 |

Reaction thermochemistry data

Data compiled by: Hussein Y. Afeefy, Joel F. Liebman, and Stephen E. Stein
Individual Reactions
By formula: 2H2 + C7H8 = C7H12
Quantity | Value | Units | Method | Reference | Comment |
---|---|---|---|---|---|
ΔrH° | -262. ± 0.4 | kJ/mol | Chyd | Roth, Adamczak, et al., 1991 | liquid phase |

Gas phase ion energetics data

Data compiled as indicated in comments:
LLK - Sharon G. Lias, Rhoda D. Levin, and Sherif A. Kafafi
RDSH - Henry M. Rosenstock, Keith Draxl, Bruce W. Steiner, and John T. Herron
Ionization energy determinations
IE (eV) | Method | Reference | Comment |
---|---|---|---|
8.35 | PE | Traeger and McLoughlin, 1978 | LLK |
8.35 | PI | Traeger and McLoughlin, 1978 | LLK |
8.92 | EI | Lifshitz and Bauer, 1963 | RDSH |
Appearance energy determinations
Ion | AE (eV) | Other Products | Method | Reference | Comment |
---|---|---|---|---|---|
C5H5+ | 14.9 | ? | EI | Harrison, Haynes, et al., 1965 | RDSH |
C5H5+ | 14.89 | ? | EI | Lifshitz and Bauer, 1963 | RDSH |
C5H6+ | 10.02 | ? | EI | Lifshitz and Bauer, 1963 | RDSH |
C7H7+ | 9.25 | H | PI | Traeger and McLoughlin, 1978 | LLK |
C7H7+ | 9.66 | H | EI | Lifshitz and Bauer, 1963 | RDSH |

References

Roth, Adamczak, et al., 1991
Roth, W.R.; Adamczak, O.; Breuckmann, R.; Lennartz, H.-W.; Boese, R.,
Die Berechnung von Resonanzenergien; das MM2ERW-Kraftfeld,
Chem. Ber., 1991, 124, 2499-2521. [all data]
Traeger and McLoughlin, 1978
Traeger, J.C.; McLoughlin, R.G.,
A photoionization study of the energetics of C7H7+ ion formed from C7H8 precursors,
Int. J. Mass Spectrom. Ion Phys., 1978, 27, 319. [all data]
Lifshitz and Bauer, 1963
Lifshitz, C.; Bauer, S.H.,
Mass spectra of valence tautomers,
J. Phys. Chem., 1963, 67, 1629. [all data]
Harrison, Haynes, et al., 1965
Harrison, A.G.; Haynes, P.; McLean, S.; Meyer, F.,
The mass spectra of methyl-substituted cyclopentadienes,
J. Am. Chem. Soc., 1965, 87, 5099. [all data]