Propane, 2-chloro-2-nitroso-
- Formula: C3H6ClNO
- Molecular weight: 107.539
- IUPAC Standard InChIKey: CJEALULDPPMPSP-UHFFFAOYSA-N
- CAS Registry Number: 2421-26-3
- Chemical structure:
View 3d structure (requires JavaScript / HTML 5) - Permanent link for this species. Use this link for bookmarking this species for future reference.

Gas phase ion energetics data

Data compiled by: Sharon G. Lias, Rhoda D. Levin, and Sherif A. Kafafi
Ionization energy determinations
IE (eV) | Method | Reference | Comment |
---|---|---|---|
9.1 ± 0.1 | PE | Egdell, Green, et al., 1975 | Vertical value |
Appearance energy determinations
Ion | AE (eV) | Other Products | Method | Reference | Comment |
---|---|---|---|---|---|
CH3+ | 13.75 | ? | EI | Day, Gowenlock, et al., 1978 | |
C2H5+ | 14.75 | ? | EI | Day, Gowenlock, et al., 1978 | |
C3H3+ | 14.35 | ? | EI | Day, Gowenlock, et al., 1978 | |
C3H4+ | 11.95 | ? | EI | Day, Gowenlock, et al., 1978 | |
C3H5+ | 11.75 | ? | EI | Day, Gowenlock, et al., 1978 | |
C3H6+ | 11.35 | ? | EI | Day, Gowenlock, et al., 1978 | |
C3H6Cl+ | 9.70 | ? | EI | Day, Gowenlock, et al., 1978 | |
C3H6NO+ | 11.80 | ? | EI | Day, Gowenlock, et al., 1978 | |
Cl+ | 22.70 | ? | EI | Day, Gowenlock, et al., 1978 | |
HCl+ | 13.35 | ? | EI | Day, Gowenlock, et al., 1978 | |
NO+ | 12.75 | CH3CCl | EI | Day, Gowenlock, et al., 1978 |

References

Egdell, Green, et al., 1975
Egdell, R.; Green, J.C.; Rao, C.N.R.; Gowenlock, B.G.; Pfab, J.,
He(I) photoelectron studies of C-nitroso compounds,
J. Chem. Soc. Faraday Trans. 2, 1975, 988. [all data]
Day, Gowenlock, et al., 1978
Day, J.S.; Gowenlock, B.G.; Johnson, C.A.F.; McInally, I.D.; Pfab, J.,
Appearance potential studies of some geminal substituted C-nitroso- compounds,
J. Chem. Soc. Perkin Trans. 2, 1978, 10, 1110. [all data]