4,4'-Biphthalic anhydride
- Formula: C16H6O6
- Molecular weight: 294.2152
- IUPAC Standard InChIKey: WKDNYTOXBCRNPV-UHFFFAOYSA-N
- CAS Registry Number: 2420-87-3
- Chemical structure:
View 3d structure (requires JavaScript / HTML 5) - Other names: [5,5'-Biisobenzofuran]-1,1',3,3'-tetrone; 3,3',4,4'-Biphenyltetracarboxylic acid dianhydride; 4,4'-biphthalic dianhydride

Gas phase ion energetics data

Data compiled by: Henry M. Rosenstock, Keith Draxl, Bruce W. Steiner, and John T. Herron
Ionization energy determinations
IE (eV) | Method | Reference |
---|---|---|
9.80 | EI | Martinez_deBertorello, Bertorello, et al., 1970 |
Appearance energy determinations
Ion | AE (eV) | Other Products | Method | Reference | Comment |
---|---|---|---|---|---|
C12H6+ | 18.47 | 2CO2+2CO | EI | Martinez_deBertorello, Bertorello, et al., 1970 | |
C13H6O+ | 15.45 | 2CO2+CO | EI | Martinez_deBertorello, Bertorello, et al., 1970 | |
C14H6O3+ | 14.36 | CO2+CO | EI | Martinez_deBertorello, Bertorello, et al., 1970 | |
C15H6O4+ | 11.36 | CO2 | EI | Martinez_deBertorello, Bertorello, et al., 1970 |

References

Martinez_deBertorello, Bertorello, et al., 1970
Martinez_deBertorello, M.; Bertorello, H.E.; GarciaMartinez, N.,
Descomposicion por impacto electronico del dianhidrido del acido 3,4,3',4'-tetracarboxibifenilo y del 4,4'-dicianobifenilo,
Anales Asoc. Quim. Arg., 1970, 58, 291. [all data]