2(1H)-Pyridinethione, 1-ethyl-3-hydroxy-6-methyl-
- Formula: C8H11NOS
- Molecular weight: 169.244
- IUPAC Standard InChIKey: BJEVGGTVTRCGSV-UHFFFAOYSA-N
- CAS Registry Number: 24207-15-6
- Chemical structure:
View 3d structure (requires JavaScript / HTML 5) - Permanent link for this species. Use this link for bookmarking this species for future reference.

Gas phase ion energetics data

Data compiled by: Sharon G. Lias, Rhoda D. Levin, and Sherif A. Kafafi
Ionization energy determinations
IE (eV) | Method | Reference |
---|---|---|
7.75 ± 0.05 | EI | Gronneberg and Undheim, 1972 |

References

Gronneberg and Undheim, 1972
Gronneberg, T.; Undheim, K.,
Mass spectrometry of onium compounds. X: on the evaporation of pyridinium-3-oxides-ionization potential measurements,
Org. Mass Spectrom., 1972, 6, 225. [all data]