Benzene,1,1'-(1-cyclopropene-1,2-diyl)bis-
- Formula: C15H12
- Molecular weight: 192.2558
- IUPAC Standard InChIKey: ZIPDPGGBRDWAMG-UHFFFAOYSA-N
- CAS Registry Number: 24168-52-3
- Chemical structure:
View 3d structure (requires JavaScript / HTML 5) - Permanent link for this species. Use this link for bookmarking this species for future reference.

Gas phase ion energetics data

Data compiled as indicated in comments:
LLK - Sharon G. Lias, Rhoda D. Levin, and Sherif A. Kafafi
Ionization energy determinations
IE (eV) | Method | Reference | Comment |
---|---|---|---|
7.45 | PE | Muller, Schweig, et al., 1978 | LLK |
10.27 | PE | Muller, Schweig, et al., 1978 | Vertical value; LLK |

References

Muller, Schweig, et al., 1978
Muller, C.; Schweig, A.; Vermeer, H.,
Photoelectron spectra of 1,2-diphenylcyclopropene, 2,3-diphenylcyclopropenone, 2,3-diphenylcyclopropenethione, 2,3-diphenylthiirene and 1-oxide; cis-stilbene, An experimental verification of conjugative inductive interactions,
J. Am. Chem. Soc., 1978, 100, 8056. [all data]