Thiophosphoryl fluoride
- Formula: F3PS
- Molecular weight: 120.034
- IUPAC Standard InChIKey: FDYJNMHGRBMQLJ-UHFFFAOYSA-N
- CAS Registry Number: 2404-52-6
- Chemical structure:
View 3d structure (requires JavaScript / HTML 5) - Permanent link for this species. Use this link for bookmarking this species for future reference.

Gas phase thermochemistry data

Quantity | Value | Units | Method | Reference | Comment |
---|---|---|---|---|---|
ΔfH°gas | -1009.07 | kJ/mol | Review | Chase, 1998 | Data last reviewed in December, 1969 |
Quantity | Value | Units | Method | Reference | Comment |
S°gas,1 bar | 298.12 | J/mol*K | Review | Chase, 1998 | Data last reviewed in December, 1969 |
Gas Phase Heat Capacity (Shomate Equation)
Cp° = A + B*t + C*t2 + D*t3 +
E/t2
H° − H°298.15= A*t + B*t2/2 +
C*t3/3 + D*t4/4 − E/t + F − H
S° = A*ln(t) + B*t + C*t2/2 + D*t3/3 −
E/(2*t2) + G
Cp = heat capacity (J/mol*K)
H° = standard enthalpy (kJ/mol)
S° = standard entropy (J/mol*K)
t = temperature (K) / 1000.
View plot Requires a JavaScript / HTML 5 canvas capable browser.
Temperature (K) | 298. to 1400. | 1400. to 6000. |
---|---|---|
A | 64.85660 | 107.8125 |
B | 91.50617 | 0.140373 |
C | -72.29617 | -0.026427 |
D | 19.93852 | 0.001728 |
E | -1.045871 | -5.145191 |
F | -1035.385 | -1055.862 |
G | 346.4821 | 406.3133 |
H | -1009.068 | -1009.068 |
Reference | Chase, 1998 | Chase, 1998 |
Comment | Data last reviewed in December, 1969 | Data last reviewed in December, 1969 |

Reaction thermochemistry data

Data compiled by: John E. Bartmess
Individual Reactions
By formula: F- + F3PS = (F- • F3PS)
Quantity | Value | Units | Method | Reference | Comment |
---|---|---|---|---|---|
ΔrH° | 201. ± 38. | kJ/mol | IMRB | Rhyne and Dillard, 1971 | gas phase; Fluoride Affinity: between SF4, SF5. Original value 32±10, now altered with new aff. |

Gas phase ion energetics data

Data compiled as indicated in comments:
LLK - Sharon G. Lias, Rhoda D. Levin, and Sherif A. Kafafi
RDSH - Henry M. Rosenstock, Keith Draxl, Bruce W. Steiner, and John T. Herron
Ionization energy determinations
IE (eV) | Method | Reference | Comment |
---|---|---|---|
11.1 ± 0.3 | EI | Kiser, Dillard, et al., 1969 | RDSH |
11.05 ± 0.035 | PE | Elbel and Dieck, 1976 | Vertical value; LLK |
Appearance energy determinations
Ion | AE (eV) | Other Products | Method | Reference | Comment |
---|---|---|---|---|---|
PF+ | 22.9 ± 0.4 | ? | EI | Kiser, Dillard, et al., 1969 | RDSH |
PF2+ | 17.2 ± 0.3 | ? | EI | Kiser, Dillard, et al., 1969 | RDSH |
PSF2+ | 16.0 ± 0.2 | F | EI | Kiser, Dillard, et al., 1969 | RDSH |
PF3+ | 14.3 ± 0.2 | S | EI | Kiser, Dillard, et al., 1969 | RDSH |
PS+ | 19.2 ± 0.5 | ? | EI | Kiser, Dillard, et al., 1969 | RDSH |

Ion clustering data

Data compiled by: John E. Bartmess
Clustering reactions
By formula: F- + F3PS = (F- • F3PS)
Quantity | Value | Units | Method | Reference | Comment |
---|---|---|---|---|---|
ΔrH° | 201. ± 38. | kJ/mol | IMRB | Rhyne and Dillard, 1971 | gas phase; Fluoride Affinity: between SF4, SF5. Original value 32±10, now altered with new aff. |

Vibrational and/or electronic energy levels

Data compiled by: Takehiko Shimanouchi
Symmetry: C3ν Symmetry Number σ = 3
Sym. | No | Approximate | Selected Freq. | Infrared | Raman | Comments | ||||
---|---|---|---|---|---|---|---|---|---|---|
Species | type of mode | Value | Rating | Value | Phase | Value | Phase | |||
a1 | 1 | PF3 s-str | 981 | B | 981 VS | gas | 969 p | liq. | ||
a1 | 2 | PS str | 695 | B | 695 M | gas | 696 p | liq. | ||
a1 | 3 | PF3 s-deform | 440 | B | 440 M | gas | 441 p | liq. | ||
e | 4 | PF3 d-str | 945 | B | 945 VS | gas | 937 dp | liq. | ||
e | 5 | PF3 d-deform | 402 | C | 402 M | gas | 404 dp | liq. | ||
e | 6 | PF3 rock | 275 | B | 275 W | gas | 276 dp | liq. | ||
Source: Shimanouchi, 1972

References

Chase, 1998
Chase, M.W., Jr.,
NIST-JANAF Themochemical Tables, Fourth Edition,
J. Phys. Chem. Ref. Data, Monograph 9, 1998, 1-1951. [all data]
Rhyne and Dillard, 1971
Rhyne, T.C.; Dillard, J.G.,
Reactions of gaseous inorganic negative ions: III. SF6- with POF3 and PSF3,
Int. J. Mass Spectrom. Ion Phys., 1971, 7, 371. [all data]
Kiser, Dillard, et al., 1969
Kiser, R.W.; Dillard, J.G.; Dugger, D.L.,
Mass spectrometry of inorganic halides,
Advan. Chem. Ser., 1969, 72, 153. [all data]
Elbel and Dieck, 1976
Elbel, S.; Dieck, H.t.,
Photoelectron spectra of group 5 compounds. Part IV. A study of the E-X bond in R3EX compounds (R = Me or F; E = N or P; X = O or S),
J. Chem. Soc. Dalton Trans., 1976, 1757. [all data]
Shimanouchi, 1972
Shimanouchi, T.,
Tables of Molecular Vibrational Frequencies Consolidated Volume II,
J. Phys. Chem. Ref. Data, 1972, 6, 3, 993-1102. [all data]