Pyrrolidine, 1-(2-methyl-1-propenyl)-
- Formula: C8H15N
- Molecular weight: 125.2114
- IUPAC Standard InChIKey: PAXNHQZTZQFBPC-UHFFFAOYSA-N
- CAS Registry Number: 2403-57-8
- Chemical structure:
View 3d structure (requires JavaScript / HTML 5) - Other names: Pyrrolidine, 1-(2-methylpropenyl)-; Isobutyraldehyde pyrrolidine enamine; N-(2-Methyl-1-propenyl)pyrrolidine; N-Isobutenylpyrrolidine; 1-(2-Methyl-1-propenyl)pyrrolidine; 1-(2-Methylpropenyl)pyrrolidine; 1-Pyrrolidino-2-methylpropene; 1-Pyrrolidinoisobutene; 2-Methyl-1-pyrrolidinopropene

Gas phase ion energetics data

Data compiled as indicated in comments:
LLK - Sharon G. Lias, Rhoda D. Levin, and Sherif A. Kafafi
Ionization energy determinations
IE (eV) | Method | Reference | Comment |
---|---|---|---|
6.8 | PE | Muller, Previdoli, et al., 1981 | LLK |
7.75 | PE | Muller, Previdoli, et al., 1981 | Vertical value; LLK |
7.66 ± 0.03 | PE | Colonna, Distefano, et al., 1975 | Vertical value; LLK |

References

Muller, Previdoli, et al., 1981
Muller, K.; Previdoli, F.; Desilvestro, H.,
246. Enamines. II. A theoretical and photoelectron spectroscopic study of the molecular and electronic structure of aliphatic enamines,
Helv. Chim. Acta, 1981, 64, 2497. [all data]
Colonna, Distefano, et al., 1975
Colonna, F.P.; Distefano, G.; Pignataro, S.; Pitacco, G.; Valentin, E.,
Ionization energies of some amines and enamines and an estimation of their relative basicity in gaseous phase,
J. Chem. Soc. Faraday Trans. 2, 1975, 71, 1572. [all data]