Morpholine, 4-(2-methyl-1-propenyl)-
- Formula: C8H15NO
- Molecular weight: 141.2108
- IUPAC Standard InChIKey: RSEUOMWVYSLIKM-UHFFFAOYSA-N
- CAS Registry Number: 2403-55-6
- Chemical structure:
View 3d structure (requires JavaScript / HTML 5) - Other names: Morpholine, 4-(2-methylpropenyl)-; 1-Morpholino-2-methylpropene; 2-Methyl-1-morpholino-1-propene; 2-Methyl-1-morpholinopropene; 4-(2-Methyl-1-propenyl)morpholine; 4-(2-Methylpropenyl)morpholine; N-Isobutenyl morpholine

Gas phase ion energetics data

Data compiled by: Sharon G. Lias, Rhoda D. Levin, and Sherif A. Kafafi
Ionization energy determinations
IE (eV) | Method | Reference | Comment |
---|---|---|---|
8.20 ± 0.03 | PE | Colonna, Distefano, et al., 1975 | Vertical value |

References

Colonna, Distefano, et al., 1975
Colonna, F.P.; Distefano, G.; Pignataro, S.; Pitacco, G.; Valentin, E.,
Ionization energies of some amines and enamines and an estimation of their relative basicity in gaseous phase,
J. Chem. Soc. Faraday Trans. 2, 1975, 71, 1572. [all data]