Cyclopropane, 1,2-dimethyl-, trans-
- Formula: C5H10
- Molecular weight: 70.1329
- IUPAC Standard InChIKey: VKJLDXGFBJBTRQ-RFZPGFLSSA-N
- CAS Registry Number: 2402-06-4
- Chemical structure:
View 3d structure (requires JavaScript / HTML 5) - Stereoisomers:
- Other names: trans-1,2-Dimethylcyclopropane; (E)-1,2-Dimethylcyclopropane

Gas phase thermochemistry data

Data compiled by: Glushko Thermocenter, Russian Academy of Sciences, Moscow
Constant pressure heat capacity of gas
Cp,gas (J/mol*K) | Temperature (K) | Reference | Comment |
---|---|---|---|
35.62 | 50. | Thermodynamics Research Center, 1997 | p=1 bar. |
49.64 | 100. | ||
63.17 | 150. | ||
76.20 | 200. | ||
97.69 | 273.15 | ||
105.57 | 298.15 | ||
106.16 | 300. | ||
137.37 | 400. | ||
164.97 | 500. | ||
188.16 | 600. | ||
207.71 | 700. | ||
224.38 | 800. | ||
238.74 | 900. | ||
251.16 | 1000. | ||
261.92 | 1100. | ||
271.24 | 1200. | ||
279.34 | 1300. | ||
286.38 | 1400. | ||
292.51 | 1500. | ||
304.7 | 1750. | ||
313.5 | 2000. | ||
320.0 | 2250. | ||
325.0 | 2500. | ||
328.8 | 2750. | ||
331.7 | 3000. |

Condensed phase thermochemistry data

Data compiled by: Hussein Y. Afeefy, Joel F. Liebman, and Stephen E. Stein
Quantity | Value | Units | Method | Reference | Comment |
---|---|---|---|---|---|
ΔfH°liquid | -30.7 ± 0.79 | kJ/mol | Ccb | Good, 1971 | |
Quantity | Value | Units | Method | Reference | Comment |
ΔcH°liquid | -3366.0 ± 0.75 | kJ/mol | Ccb | Good, 1971 | Corresponding ΔfHºliquid = -30.7 kJ/mol (simple calculation by NIST; no Washburn corrections) |

Phase change data

Data compiled by: Thermodynamics Research Center, NIST Boulder Laboratories, Chris Muzny director
Quantity | Value | Units | Method | Reference | Comment |
---|---|---|---|---|---|
Tboil | 301.5 ± 0.9 | K | AVG | N/A | Average of 7 values; Individual data points |
Quantity | Value | Units | Method | Reference | Comment |
Tfus | 123.4 ± 0.3 | K | AVG | N/A | Average of 11 values; Individual data points |

Gas phase ion energetics data

Data compiled as indicated in comments:
LL - Sharon G. Lias and Joel F. Liebman
RDSH - Henry M. Rosenstock, Keith Draxl, Bruce W. Steiner, and John T. Herron
Ionization energy determinations
IE (eV) | Method | Reference | Comment |
---|---|---|---|
9.02 ± 0.05 | EI | Holmes and Lossing, 1991 | LL |
9.73 ± 0.02 | EI | Natalis and Laune, 1964 | RDSH |
Appearance energy determinations
Ion | AE (eV) | Other Products | Method | Reference | Comment |
---|---|---|---|---|---|
C3H6+ | 11.29 ± 0.05 | C2H4 | EI | Natalis and Laune, 1964 | RDSH |
C4H7+ | 11.38 ± 0.04 | CH3 | EI | Natalis and Laune, 1964 | RDSH |

References

Thermodynamics Research Center, 1997
Thermodynamics Research Center,
Selected Values of Properties of Chemical Compounds., Thermodynamics Research Center, Texas A&M University, College Station, Texas, 1997. [all data]
Good, 1971
Good, W.D.,
The enthalpies of combustion and formation of some alkyl cyclopropanes,
J. Chem. Thermodyn., 1971, 3, 539-546. [all data]
Holmes and Lossing, 1991
Holmes, J.L.; Lossing, F.P.,
Ionization energies of homologous organic compounds and correlation with molecular size,
Org. Mass Spectrom., 1991, 26, 537. [all data]
Natalis and Laune, 1964
Natalis, P.; Laune, J.,
Etude du comportement d'isomeres geometriques sous l'impact electronique. IV. Cyclopropane, methylcyclopropane et dimethylcyclopropanes gem. cis et trans,
Bull. Soc. Chim. Belges, 1964, 73, 944. [all data]