Benzene, (1-butylhexadecyl)-
- Formula: C26H46
- Molecular weight: 358.6434
- IUPAC Standard InChIKey: KINRJYWUZLHOKP-UHFFFAOYSA-N
- CAS Registry Number: 2400-04-6
- Chemical structure:
View 3d structure (requires JavaScript / HTML 5) - Other names: Eicosane, 5-phenyl-; 5-Phenyleicosane

Phase change data

Data compiled as indicated in comments:
TRC - Thermodynamics Research Center, NIST Boulder Laboratories, Chris Muzny director
AC - William E. Acree, Jr., James S. Chickos
Quantity | Value | Units | Method | Reference | Comment |
---|---|---|---|---|---|
Tfus | 267. | K | N/A | Petrov and Chel'tsova, 1942 | Uncertainty assigned by TRC = 4. K; TRC |
Enthalpy of vaporization
ΔvapH (kJ/mol) | Temperature (K) | Method | Reference | Comment |
---|---|---|---|---|
94.3 | 500. | A,MG | Stephenson and Malanowski, 1987 | Based on data from 485. to 521. K. See also Schiessler and Whitmore, 1955.; AC |

Gas phase ion energetics data

Data compiled by: Henry M. Rosenstock, Keith Draxl, Bruce W. Steiner, and John T. Herron
Ionization energy determinations
IE (eV) | Method | Reference |
---|---|---|
9.0 ± 0.1 | EI | King, 1965 |
Appearance energy determinations
Ion | AE (eV) | Other Products | Method | Reference | Comment |
---|---|---|---|---|---|
C7H7+ | 12.3 ± 0.1 | ? | EI | King, 1965 | |
C11H15+ | 10.4 ± 0.1 | ? | EI | King, 1965 | |
C22H37+ | 10. ± 0.1 | ? | EI | King, 1965 |

References

Petrov and Chel'tsova, 1942
Petrov, A.D.; Chel'tsova, M.A.,
Synthesis and Properties of Hydrocarbons of the Aromatic and Naphthenic Series of the Composition C19-C26. II.,
J. Gen. Chem. USSR (Engl. Transl.), 1942, 12, 87-94. [all data]
Stephenson and Malanowski, 1987
Stephenson, Richard M.; Malanowski, Stanislaw,
Handbook of the Thermodynamics of Organic Compounds, 1987, https://doi.org/10.1007/978-94-009-3173-2
. [all data]
Schiessler and Whitmore, 1955
Schiessler, R.W.; Whitmore, F.C.,
Properties of High Molecular Weight Hydrocarbons,
Ind. Eng. Chem., 1955, 47, 8, 1660-1665, https://doi.org/10.1021/ie50548a054
. [all data]
King, 1965
King, A.B.,
Mass-spectral fragmentation of phenyl-n-alkanes,
J. Chem. Phys., 1965, 42, 3526. [all data]