Benzene, (1-propylheptadecyl)-
- Formula: C26H46
- Molecular weight: 358.6434
- IUPAC Standard InChIKey: RFNYELHDUBVQMR-UHFFFAOYSA-N
- CAS Registry Number: 2400-03-5
- Chemical structure:
View 3d structure (requires JavaScript / HTML 5) - Other names: Eicosane, 4-phenyl-; 4-Phenyleicosane

Phase change data

Data compiled by: William E. Acree, Jr., James S. Chickos
Enthalpy of vaporization
ΔvapH (kJ/mol) | Temperature (K) | Method | Reference | Comment |
---|---|---|---|---|
88.2 | 502. | A,MG | Stephenson and Malanowski, 1987 | Based on data from 487. to 527. K. See also Schiessler and Whitmore, 1955. |

Gas phase ion energetics data

Data compiled by: Henry M. Rosenstock, Keith Draxl, Bruce W. Steiner, and John T. Herron
Ionization energy determinations
IE (eV) | Method | Reference |
---|---|---|
9.0 ± 0.1 | EI | King, 1965 |
Appearance energy determinations
Ion | AE (eV) | Other Products | Method | Reference | Comment |
---|---|---|---|---|---|
C7H7+ | 12.3 ± 0.1 | ? | EI | King, 1965 | |
C10H13+ | 10.6 ± 0.1 | ? | EI | King, 1965 | |
C23H39+ | 9.8 ± 0.1 | ? | EI | King, 1965 |

References

Stephenson and Malanowski, 1987
Stephenson, Richard M.; Malanowski, Stanislaw,
Handbook of the Thermodynamics of Organic Compounds, 1987, https://doi.org/10.1007/978-94-009-3173-2
. [all data]
Schiessler and Whitmore, 1955
Schiessler, R.W.; Whitmore, F.C.,
Properties of High Molecular Weight Hydrocarbons,
Ind. Eng. Chem., 1955, 47, 8, 1660-1665, https://doi.org/10.1021/ie50548a054
. [all data]
King, 1965
King, A.B.,
Mass-spectral fragmentation of phenyl-n-alkanes,
J. Chem. Phys., 1965, 42, 3526. [all data]