Benzene, eicosyl-
- Formula: C26H46
- Molecular weight: 358.6434
- IUPAC Standard InChIKey: HPPLZROUJULWGU-UHFFFAOYSA-N
- CAS Registry Number: 2398-68-7
- Chemical structure:
View 3d structure (requires JavaScript / HTML 5) - Other names: Eicosane, 1-phenyl-; n-Eicosylbenzene; 1-Phenyleicosane

Phase change data

Data compiled as indicated in comments:
TRC - Thermodynamics Research Center, NIST Boulder Laboratories, Chris Muzny director
AC - William E. Acree, Jr., James S. Chickos
Quantity | Value | Units | Method | Reference | Comment |
---|---|---|---|---|---|
Tfus | 315. ± 3. | K | AVG | N/A | Average of 6 values; Individual data points |
Enthalpy of vaporization
ΔvapH (kJ/mol) | Temperature (K) | Method | Reference | Comment |
---|---|---|---|---|
94.7 | 514. | A,MG | Stephenson and Malanowski, 1987 | Based on data from 499. to 538. K. See also Schiessler and Whitmore, 1955.; AC |

Gas phase ion energetics data

Data compiled by: Henry M. Rosenstock, Keith Draxl, Bruce W. Steiner, and John T. Herron
Ionization energy determinations
IE (eV) | Method | Reference |
---|---|---|
9.3 ± 0.1 | EI | King, 1965 |
Appearance energy determinations
Ion | AE (eV) | Other Products | Method | Reference | Comment |
---|---|---|---|---|---|
C7H7+ | 11.8 ± 0.1 | ? | EI | King, 1965 | |
C7H8+ | 11.4 ± 0.1 | ? | EI | King, 1965 | |
C8H8+ | 12.2 ± 0.1 | ? | EI | King, 1965 | |
C10H13+ | 10.9 ± 0.1 | ? | EI | King, 1965 |

References

Stephenson and Malanowski, 1987
Stephenson, Richard M.; Malanowski, Stanislaw,
Handbook of the Thermodynamics of Organic Compounds, 1987, https://doi.org/10.1007/978-94-009-3173-2
. [all data]
Schiessler and Whitmore, 1955
Schiessler, R.W.; Whitmore, F.C.,
Properties of High Molecular Weight Hydrocarbons,
Ind. Eng. Chem., 1955, 47, 8, 1660-1665, https://doi.org/10.1021/ie50548a054
. [all data]
King, 1965
King, A.B.,
Mass-spectral fragmentation of phenyl-n-alkanes,
J. Chem. Phys., 1965, 42, 3526. [all data]
Kusakov, et al., 1963
Kusakov, M.M., et al.,
Ultraviolet Absorption Spectra of Aromatic Hydrocarbons, 1963, 53. [all data]