Benzene, (1-octyldodecyl)-
- Formula: C26H46
- Molecular weight: 358.6434
- IUPAC Standard InChIKey: KZUKFVROQBTEQY-UHFFFAOYSA-N
- CAS Registry Number: 2398-65-4
- Chemical structure:
View 3d structure (requires JavaScript / HTML 5) - Other names: Eicosane, 9-phenyl-; 9-Phenyleicosane

Condensed phase thermochemistry data

Data compiled by: Hussein Y. Afeefy, Joel F. Liebman, and Stephen E. Stein
Quantity | Value | Units | Method | Reference | Comment |
---|---|---|---|---|---|
ΔfH°liquid | -476.0 ± 6.3 | kJ/mol | Ccb | Knowlton and Huffman, 1944 | Reanalyzed by Cox and Pilcher, 1970, Original value = -477.8 kJ/mol |
Quantity | Value | Units | Method | Reference | Comment |
ΔcH°liquid | -16329.3 ± 6.3 | kJ/mol | Ccb | Knowlton and Huffman, 1944 | Reanalyzed by Cox and Pilcher, 1970, Original value = -16328. kJ/mol; Corresponding ΔfHºliquid = -476.06 kJ/mol (simple calculation by NIST; no Washburn corrections) |

Phase change data

Data compiled as indicated in comments:
TRC - Thermodynamics Research Center, NIST Boulder Laboratories, Chris Muzny director
AC - William E. Acree, Jr., James S. Chickos
Quantity | Value | Units | Method | Reference | Comment |
---|---|---|---|---|---|
Tfus | 291.05 | K | N/A | Anonymous, 1968 | Uncertainty assigned by TRC = 0.5 K; TRC |
Enthalpy of vaporization
ΔvapH (kJ/mol) | Temperature (K) | Method | Reference | Comment |
---|---|---|---|---|
91.9 | 498. | A,MG | Stephenson and Malanowski, 1987 | Based on data from 483. to 520. K. See also Schiessler and Whitmore, 1955.; AC |

Gas phase ion energetics data

Data compiled by: Henry M. Rosenstock, Keith Draxl, Bruce W. Steiner, and John T. Herron
Ionization energy determinations
IE (eV) | Method | Reference |
---|---|---|
9.1 ± 0.1 | EI | King, 1965 |
Appearance energy determinations
Ion | AE (eV) | Other Products | Method | Reference | Comment |
---|---|---|---|---|---|
C7H7+ | 12.1 ± 0.1 | ? | EI | King, 1965 | |
C15H23+ | 10.3 ± 0.1 | ? | EI | King, 1965 | |
C18H29+ | 10.12 | ? | EI | King, 1965 |

References

Knowlton and Huffman, 1944
Knowlton, J.W.; Huffman, H.M.,
The heats of combustion of some substituted eicosanes, heneicosanes and docosanes,
J. Am. Chem. Soc., 1944, 66, 1492-1494. [all data]
Cox and Pilcher, 1970
Cox, J.D.; Pilcher, G.,
Thermochemistry of Organic and Organometallic Compounds, Academic Press, New York, 1970, 1-636. [all data]
Anonymous, 1968
Anonymous, R.,
Properties of hydrocarbon of high molecular weight, Am. Pet. Inst. Res. Proj. 42, Penn. State Univ., 1968. [all data]
Stephenson and Malanowski, 1987
Stephenson, Richard M.; Malanowski, Stanislaw,
Handbook of the Thermodynamics of Organic Compounds, 1987, https://doi.org/10.1007/978-94-009-3173-2
. [all data]
Schiessler and Whitmore, 1955
Schiessler, R.W.; Whitmore, F.C.,
Properties of High Molecular Weight Hydrocarbons,
Ind. Eng. Chem., 1955, 47, 8, 1660-1665, https://doi.org/10.1021/ie50548a054
. [all data]
King, 1965
King, A.B.,
Mass-spectral fragmentation of phenyl-n-alkanes,
J. Chem. Phys., 1965, 42, 3526. [all data]
Kusakov, et al., 1963
Kusakov, M.M., et al.,
Ultraviolet Absorption Spectra of Aromatic Hydrocarbons, 1963, 54. [all data]