Benzene, 1-bromo-3-methoxy-
- Formula: C7H7BrO
- Molecular weight: 187.034
- IUPAC Standard InChIKey: PLDWAJLZAAHOGG-UHFFFAOYSA-N
- CAS Registry Number: 2398-37-0
- Chemical structure:
View 3d structure (requires JavaScript / HTML 5) - Other names: Anisole, m-bromo-; m-Anisyl bromide; m-Bromoanisole; 3-Bromoanisole; m-Bromomethoxybenzene; m-Bromophenyl methyl ether; m-Methoxybromobenzene; 3-Methoxybromobenzene; 3-Methoxy-1-bromobenzene; m-Methoxyphenyl bromide; 3-Methoxyphenyl bromide; 3-Bromoanisol; 1-Bromo-3-methoxybenzene; NSC 82293

Phase change data

Data compiled as indicated in comments:
BS - Robert L. Brown and Stephen E. Stein
AC - William E. Acree, Jr., James S. Chickos
Quantity | Value | Units | Method | Reference | Comment |
---|---|---|---|---|---|
Tboil | 483.7 | K | N/A | Aldrich Chemical Company Inc., 1990 | BS |
Tboil | 483. to 484. | K | N/A | Frinton Laboratories Inc., 1986 | BS |
Quantity | Value | Units | Method | Reference | Comment |
ΔvapH° | 58.0 ± 1.2 | kJ/mol | C | Ribeiro da Silva and Lobo Ferreira, 2009 | AC |

Gas phase ion energetics data

Data compiled by: Henry M. Rosenstock, Keith Draxl, Bruce W. Steiner, and John T. Herron
Ionization energy determinations
IE (eV) | Method | Reference |
---|---|---|
8.7 ± 0.1 | EI | Brown, 1970 |
Appearance energy determinations
Ion | AE (eV) | Other Products | Method | Reference | Comment |
---|---|---|---|---|---|
C6H4OBr+ | 12.3 ± 0.1 | CH3 | EI | Brown, 1970 | |
C6H5Br+ | 11.6 ± 0.1 | CH2O | EI | Brown, 1970 |

Normal alkane RI, non-polar column, temperature ramp

Column type | Active phase | I | Reference | Comment |
---|---|---|---|---|
Capillary | Ultra-1 | 1149. | Okumura, 1991 | 25. m/0.32 mm/0.25 μm, He, 3. K/min; Tstart: 80. C; Tend: 260. C |

Normal alkane RI, non-polar column, custom temperature program

Column type | Active phase | I | Reference | Comment |
---|---|---|---|---|
Capillary | CP Sil 2 | 1100. | Fuhrer, Deissler, et al., 1997 | 55. m/0.25 mm/0.25 μm, N2; Program: 40C(3min) => 20C/min => 80C => 2C/min => 240C(45min) |

References

Aldrich Chemical Company Inc., 1990
Aldrich Chemical Company Inc.,
Catalog Handbook of Fine Chemicals, Aldrich Chemical Company, Inc., Milwaukee WI, 1990, 1. [all data]
Frinton Laboratories Inc., 1986
Frinton Laboratories Inc.,
Catalog Number 11, Frinton Laboratories Inc., Vineland, NJ, 1986, 99. [all data]
Ribeiro da Silva and Lobo Ferreira, 2009
Ribeiro da Silva, Manuel A.V.; Lobo Ferreira, Ana I.M.C.,
Experimental and computational study on the molecular energetics of monobromoanisole isomers,
The Journal of Chemical Thermodynamics, 2009, 41, 4, 499-505, https://doi.org/10.1016/j.jct.2008.11.008
. [all data]
Brown, 1970
Brown, P.,
Kinetic studies in mass spectrometry. VIII. Competing [M-CH3] and [M-CH2O] reactions in substituted anisoles. Approximate activation energies from ionization appearance potentials,
Org. Mass Spectrom., 1970, 4, 519. [all data]
Okumura, 1991
Okumura, T.,
retention indices of environmental chemicals on methyl silicone capillary column,
Journal of Environmental Chemistry (Japan), 1991, 1, 2, 333-358, https://doi.org/10.5985/jec.1.333
. [all data]
Fuhrer, Deissler, et al., 1997
Fuhrer, U.; Deissler, A.; Schreitmuller, J.; Ballschmiter, K.,
Analysis of Halogenated Methoxybenzenes and Hexachlorobenzene (HCB) in the Picogram m-3 Range in Marine Air,
Chromatographia, 1997, 45, 1, 414-427, https://doi.org/10.1007/BF02505594
. [all data]