4,7,13,16,21,24-Hexaoxa-1,10-diazabicyclo[8.8.8]hexacosane
- Formula: C18H36N2O6
- Molecular weight: 376.4882
- IUPAC Standard InChIKey: AUFVJZSDSXXFOI-UHFFFAOYSA-N
- CAS Registry Number: 23978-09-8
- Chemical structure:
View 3d structure (requires JavaScript / HTML 5) - Other names: Kryptofix 222; Cryptand 222; Cryptate 222; Cryptating agent 222; Kriptofix 222; Kryptofix Merck 222; 2,2,2-Cryptand; 13,16,21,24-Hexaoxa-1,10-diazabicyclo-(8,8,8)-hexacosane; Ligand 222; Crypt-2,2,2; Cryptand C 222; Cryptofix 222; Kryptand 222; NSC 264495

Gas phase ion energetics data

Data compiled as indicated in comments:
LBLHLM - Sharon G. Lias, John E. Bartmess, Joel F. Liebman, John L. Holmes, Rhoda D. Levin, and W. Gary Mallard
Ionization energy determinations
IE (eV) | Method | Reference | Comment |
---|---|---|---|
7.5 | PE | Baker, Armen, et al., 1983 | LBLHLM |
7.8 | PE | Baker, Armen, et al., 1983 | Vertical value; LBLHLM |

References

Baker, Armen, et al., 1983
Baker, A.D.; Armen, G.H.; Funaro, S.,
Oral levels of crown ethers and related macrocycles studies by ultraviolet photoelectron spectroscopy: Relationship to complexation studies,
J. Chem. Soc. Dalton Trans., 1983, 2519. [all data]