1,6-Heptadiyne
- Formula: C7H8
- Molecular weight: 92.1384
- IUPAC Standard InChIKey: RSPZSDWVQWRAEF-UHFFFAOYSA-N
- CAS Registry Number: 2396-63-6
- Chemical structure:
View 3d structure (requires JavaScript / HTML 5) - Other names: hepta-1,6-diyne

Phase change data

Data compiled as indicated in comments:
BS - Robert L. Brown and Stephen E. Stein
TRC - Thermodynamics Research Center, NIST Boulder Laboratories, Chris Muzny director
Quantity | Value | Units | Method | Reference | Comment |
---|---|---|---|---|---|
Tboil | 385.2 | K | N/A | Weast and Grasselli, 1989 | BS |
Tboil | 384.65 | K | N/A | Henne and Greenlee, 1945 | Uncertainty assigned by TRC = 0.3 K; TRC |
Tboil | 385.2 | K | N/A | Lespieau and Journaud, 1929 | Uncertainty assigned by TRC = 3. K; TRC |
Quantity | Value | Units | Method | Reference | Comment |
Tfus | 188.31 | K | N/A | Henne and Greenlee, 1945 | Uncertainty assigned by TRC = 0.6 K; TRC |
Reduced pressure boiling point
Tboil (K) | Pressure (bar) | Reference | Comment |
---|---|---|---|
381. | 0.016 | Farchan Laboratories, 1990 | BS |
393. | 0.080 | Farchan Laboratories, 1990 | BS |

Reaction thermochemistry data

Data compiled by: John E. Bartmess
Individual Reactions
C7H7- + =
Quantity | Value | Units | Method | Reference | Comment |
---|---|---|---|---|---|
ΔrH° | 1575. ± 21. | kJ/mol | D-EA | Gunion, Karney, et al., 1996 | gas phase |

Gas phase ion energetics data

Data compiled as indicated in comments:
B - John E. Bartmess
LLK - Sharon G. Lias, Rhoda D. Levin, and Sherif A. Kafafi
Ionization energy determinations
IE (eV) | Method | Reference | Comment |
---|---|---|---|
9.85 ± 0.01 | PE | Traeger and McLoughlin, 1978 | LLK |
9.85 ± 0.01 | PI | Traeger and McLoughlin, 1978 | LLK |
Appearance energy determinations
Ion | AE (eV) | Other Products | Method | Reference | Comment |
---|---|---|---|---|---|
C7H7+ | 9.85 ± 0.01 | H | PI | Traeger and McLoughlin, 1978 | LLK |
De-protonation reactions
C7H7- + =
Quantity | Value | Units | Method | Reference | Comment |
---|---|---|---|---|---|
ΔrH° | 1575. ± 21. | kJ/mol | D-EA | Gunion, Karney, et al., 1996 | gas phase; B |

Kovats' RI, non-polar column, isothermal

Column type | Active phase | Temperature (C) | I | Reference | Comment |
---|---|---|---|---|---|
Packed | Squalane | 27. | 664. | Hively and Hinton, 1968 | He, Chromosorb P; Column length: 15. m; Column diameter: 0.25 mm |
Packed | Squalane | 49. | 663. | Hively and Hinton, 1968 | He, Chromosorb P; Column length: 15. m; Column diameter: 0.25 mm |
Packed | Squalane | 67. | 664. | Hively and Hinton, 1968 | He, Chromosorb P; Column length: 15. m; Column diameter: 0.25 mm |
Packed | Squalane | 86. | 664. | Hively and Hinton, 1968 | He, Chromosorb P; Column length: 15. m; Column diameter: 0.25 mm |

References

Weast and Grasselli, 1989
CRC Handbook of Data on Organic Compounds, 2nd Editon, Weast,R.C and Grasselli, J.G., ed(s)., CRC Press, Inc., Boca Raton, FL, 1989, 1. [all data]
Henne and Greenlee, 1945
Henne, A.L.; Greenlee, K.W.,
Preparation and Physical Constants of Acetylenic Compounds,
J. Am. Chem. Soc., 1945, 67, 484-5. [all data]
Lespieau and Journaud, 1929
Lespieau, R.; Journaud,
C. R. Hebd. Seances Acad. Sci., 1929, 188, 1410. [all data]
Farchan Laboratories, 1990
Farchan Laboratories,
Research Chemicals Catalog, Farchan Laboratories, Gainesville, FL, 1990, 91. [all data]
Gunion, Karney, et al., 1996
Gunion, R.F.; Karney, W.; Wenthold, P.G.; Borden, W.T.; Lineberger, W.C.,
Ultraviolet Photoelectron Spectroscopy of Some C7H7- Isomers: Quadricyclanide, Norbornadienide, Cycloheptatrienide, and 1,6-Heptadiynide,
J. Am. Chem. Soc., 1996, 118, 21, 5074, https://doi.org/10.1021/ja954026f
. [all data]
Traeger and McLoughlin, 1978
Traeger, J.C.; McLoughlin, R.G.,
A photoionization study of the energetics of C7H7+ ion formed from C7H8 precursors,
Int. J. Mass Spectrom. Ion Phys., 1978, 27, 319. [all data]
Hively and Hinton, 1968
Hively, R.A.; Hinton, R.E.,
Variation of the retention index with temperature on squalane substrates,
J. Gas Chromatogr., 1968, 6, 4, 203-217, https://doi.org/10.1093/chromsci/6.4.203
. [all data]