p-Methoxyphenyl radical
- Formula: C7H7O
- Molecular weight: 107.1299
- IUPAC Standard InChIKey: GPKUICFDWYEPTK-UHFFFAOYSA-N
- CAS Registry Number: 2396-03-4
- Chemical structure:
View 3d structure (requires JavaScript / HTML 5) - Permanent link for this species. Use this link for bookmarking this species for future reference.

Gas phase ion energetics data

Data compiled as indicated in comments:
LLK - Sharon G. Lias, Rhoda D. Levin, and Sherif A. Kafafi
B - John E. Bartmess
Electron affinity determinations
EA (eV) | Method | Reference | Comment |
---|---|---|---|
1.10 ± 0.19 | D-EA | Dahlke and Kass, 1992 | Acid: anisole. Between o-OMe-phenide and Me2NH.; B |
Ionization energy determinations
IE (eV) | Method | Reference | Comment |
---|---|---|---|
8.32 | DER | Nuyken and Messmer, 1977 | LLK |

References

Dahlke and Kass, 1992
Dahlke, G.D.; Kass, S.R.,
The Ortho-dehydrophenoxy Anion,
Int. J. Mass Spectrom. Ion Proc., 1992, 117, 633, https://doi.org/10.1016/0168-1176(92)80117-J
. [all data]
Nuyken and Messmer, 1977
Nuyken, O.; Messmer, K.,
Massenspektrometrische untersuchungen an azoverbindungen. II- Ermittlung thermodynamischer grossen,
Org. Mass Spectrom., 1977, 12, 106. [all data]