5,7,12,14-Pentacenetetrone
- Formula: C22H10O4
- Molecular weight: 338.3124
- IUPAC Standard InChIKey: YZOGOBWHTVNKGA-UHFFFAOYSA-N
- CAS Registry Number: 23912-79-0
- Chemical structure:
View 3d structure (requires JavaScript / HTML 5) - Permanent link for this species. Use this link for bookmarking this species for future reference.

Gas phase ion energetics data

Data compiled by: Sharon G. Lias, Rhoda D. Levin, and Sherif A. Kafafi
Ionization energy determinations
IE (eV) | Method | Reference |
---|---|---|
9.22 ± 0.05 | PI | Potapov and Sorokin, 1971 |

References

Potapov and Sorokin, 1971
Potapov, V.K.; Sorokin, V.V.,
Photoionization and ion-molecule reactions in quinones and alcohols,
High Energy Chem., 1971, 5, 435, In original 487. [all data]
Baxter, et al., 1971
Baxter, I., et al.,
J. Chem. Soc., 1971, Sect. C, 1253. [all data]