3,3a,7,7a,11,11a-Hexahydro-3,3,7,7,11,11-hexamethyl-tripyrazolo[1,5-a:1',5'-c:1",5"-e][1,3,5]triazine
- Formula: C15H24N6
- Molecular weight: 288.3913
- IUPAC Standard InChIKey: WCHSNQACQIWXIG-UHFFFAOYSA-N
- CAS Registry Number: 23889-83-0
- Chemical structure:
View 3d structure (requires JavaScript / HTML 5) - Permanent link for this species. Use this link for bookmarking this species for future reference.

Gas phase ion energetics data

Data compiled by: Sharon G. Lias, John E. Bartmess, Joel F. Liebman, John L. Holmes, Rhoda D. Levin, and W. Gary Mallard
Ionization energy determinations
IE (eV) | Method | Reference | Comment |
---|---|---|---|
7.5 | PE | Beck, Hunig, et al., 1986 | |
7.77 | PE | Beck, Hunig, et al., 1986 | Vertical value |

References

Beck, Hunig, et al., 1986
Beck, K.; Hunig, S.; Poppek, R.; Prokschy, F.; Rademacher, P.,
Photoelektronenspektroscopische untersuchungen an hexahydro-1,3,5-triazinen,
Chem. Ber., 1986, 119, 554. [all data]