Benzene, 1-methoxy-2-(methylthio)-
- Formula: C8H10OS
- Molecular weight: 154.229
- IUPAC Standard InChIKey: YCUXDIFPTHNTSR-UHFFFAOYSA-N
- CAS Registry Number: 2388-73-0
- Chemical structure:
View 3d structure (requires JavaScript / HTML 5) - Other names: Anisole, o-(methylthio)-; o-Methoxyphenyl methyl sulfide; 1-Methoxy-2-methylthiobenzene; 2-Methoxythiophenol, S-methyl-; 1-Methoxy-2-(methylsulfanyl)benzene

Gas phase ion energetics data

Data compiled as indicated in comments:
LLK - Sharon G. Lias, Rhoda D. Levin, and Sherif A. Kafafi
Ionization energy determinations
IE (eV) | Method | Reference | Comment |
---|---|---|---|
8.05 | PE | Chmutova, Vtyurina, et al., 1979 | Vertical value; LLK |

Van Den Dool and Kratz RI, non-polar column, custom temperature program

Column type | Active phase | I | Reference | Comment |
---|---|---|---|---|
Capillary | VF-5MS | 1350.8 | Tret'yakov, 2008 | 30. m/0.25 mm/0.25 μm, He; Program: Multi-step temperature program; T(initial)=60C; T(final)=270C |

References

Chmutova, Vtyurina, et al., 1979
Chmutova, G.A.; Vtyurina, N.N.; Komina, T.V.; Gazizov, I.G.; Bock, H.,
Molecular-orbital characteristics of anisole isologs X-C6H4-ECH3 (E = O, S, Se) containing donor substituents X,
Zh. Obshch. Khim., 1979, 49, 192. [all data]
Tret'yakov, 2008
Tret'yakov, K.V.,
Retention Data. NIST Mass Spectrometry Data Center., NIST Mass Spectrometry Data Center, 2008. [all data]