Benzenamine,N,N-dimethyl-4-(methylthio)-
- Formula: C9H13NS
- Molecular weight: 167.271
- IUPAC Standard InChIKey: BZFWSDQZPYVFHP-UHFFFAOYSA-N
- CAS Registry Number: 2388-51-4
- Chemical structure:
View 3d structure (requires JavaScript / HTML 5) - Species with the same structure:

Gas phase ion energetics data

Data compiled by: Sharon G. Lias, Rhoda D. Levin, and Sherif A. Kafafi
Ionization energy determinations
IE (eV) | Method | Reference | Comment |
---|---|---|---|
7.29 ± 0.01 | PE | Bernardi, Distefano, et al., 1975 | Vertical value |

References

Bernardi, Distefano, et al., 1975
Bernardi, F.; Distefano, G.; Mangini, A.; Pignataro, S.; Spunta, G.,
Photoelectron spectra of substituted anisoles thioanisoles,
J. Electron Spectrosc. Relat. Phenom., 1975, 7, 457. [all data]