2-Decyne
- Formula: C10H18
- Molecular weight: 138.2499
- IUPAC Standard InChIKey: RWDDSTHSVISBEA-UHFFFAOYSA-N
- CAS Registry Number: 2384-70-5
- Chemical structure:
View 3d structure (requires JavaScript / HTML 5) - Other names: 2-C10H18

Gas phase thermochemistry data

Data compiled by: Hussein Y. Afeefy, Joel F. Liebman, and Stephen E. Stein
Quantity | Value | Units | Method | Reference | Comment |
---|---|---|---|---|---|
ΔfH°gas | 23.6 ± 3.4 | kJ/mol | Chyd | Rogers, Dagdagan, et al., 1979 |

Phase change data

Data compiled by: Robert L. Brown and Stephen E. Stein
Reduced pressure boiling point
Tboil (K) | Pressure (bar) | Reference |
---|---|---|
357. | 0.031 | Farchan Laboratories, 1990 |

Reaction thermochemistry data

Data compiled by: Hussein Y. Afeefy, Joel F. Liebman, and Stephen E. Stein
Individual Reactions
By formula: 2H2 + C10H18 = C10H22
Quantity | Value | Units | Method | Reference | Comment |
---|---|---|---|---|---|
ΔrH° | -273.1 ± 2.1 | kJ/mol | Chyd | Rogers, Dagdagan, et al., 1979 | liquid phase; solvent: Hexane |

Gas phase ion energetics data

Data compiled as indicated in comments:
LLK - Sharon G. Lias, Rhoda D. Levin, and Sherif A. Kafafi
Ionization energy determinations
IE (eV) | Method | Reference | Comment |
---|---|---|---|
9.30 ± 0.02 | PI | Rang and Martinson, 1978 | LLK |

Kovats' RI, non-polar column, isothermal

Column type | Active phase | Temperature (C) | I | Reference | Comment |
---|---|---|---|---|---|
Capillary | Squalane | 80. | 1041. | Soják, Farkas, et al., 1991 | 107. m/0.25 mm/0.40 μm, H2 |
Capillary | OV-101 | 110. | 1064. | Kuningas, Rang, et al., 1990 | He; Column length: 50. m; Column diameter: 0.25 mm |
Capillary | Squalane | 100. | 1041. | Rang, Kuningas, et al., 1976 | N2; Column length: 100. m; Column diameter: 0.25 mm |
Capillary | Squalane | 110. | 1041. | Rang, Kuningas, et al., 1976 | N2; Column length: 100. m; Column diameter: 0.25 mm |
Capillary | Squalane | 120. | 1040. | Rang, Kuningas, et al., 1976 | N2; Column length: 100. m; Column diameter: 0.25 mm |
Capillary | Squalane | 130. | 1040. | Rang, Kuningas, et al., 1976 | N2; Column length: 100. m; Column diameter: 0.25 mm |
Capillary | Squalane | 90. | 1041. | Rang, Kuningas, et al., 1976 | N2; Column length: 100. m; Column diameter: 0.25 mm |
Capillary | Apiezon L | 110. | 1052. | Rang, Kuningas, et al., 1976 | N2; Column length: 50. m; Column diameter: 0.25 mm |
Capillary | Apiezon L | 130. | 1052. | Rang, Kuningas, et al., 1976 | N2; Column length: 50. m; Column diameter: 0.25 mm |
Capillary | Apiezon L | 150. | 1051. | Rang, Kuningas, et al., 1976 | N2; Column length: 50. m; Column diameter: 0.25 mm |

Kovats' RI, polar column, isothermal

Column type | Active phase | Temperature (C) | I | Reference | Comment |
---|---|---|---|---|---|
Capillary | PEG-20M | 80. | 1240.7 | Orav, Kuningas, et al., 1994 | 50. m/0.2 mm/0.13 μm, He |
Capillary | PEG-20M | 80. | 1248.0 | Orav, Kuningas, et al., 1994 | 50. m/0.2 mm/0.19 μm, He |
Capillary | PEG-20M | 80. | 1251.7 | Orav, Kuningas, et al., 1994 | 50. m/0.2 mm/0.22 μm, He |
Capillary | PEG 4000 | 100. | 1263. | Rang, Orav, et al., 1988 | |
Capillary | PEG 4000 | 110. | 1263. | Rang, Orav, et al., 1988 | |
Capillary | PEG 4000 | 120. | 1264. | Rang, Orav, et al., 1988 | |
Capillary | PEG 4000 | 140. | 1265. | Rang, Orav, et al., 1988 | |
Capillary | PEG 4000 | 80. | 1262. | Rang, Orav, et al., 1988 | |
Capillary | PEG-20M | 61. | 1234.5 | Orav, Kuningas, et al., 1985 | Column length: 100. m; Column diameter: 0.25 mm |
Capillary | PEG-20M | 61. | 1253.2 | Orav, Kuningas, et al., 1985 | Column length: 100. m; Column diameter: 0.25 mm |
Capillary | PEG-20M | 70. | 1237.1 | Orav, Kuningas, et al., 1985 | Column length: 100. m; Column diameter: 0.25 mm |
Capillary | PEG-20M | 70. | 1255.5 | Orav, Kuningas, et al., 1985 | Column length: 100. m; Column diameter: 0.25 mm |
Capillary | PEG-20M | 80. | 1256.9 | Orav, Kuningas, et al., 1985 | Column length: 100. m; Column diameter: 0.25 mm |

References

Rogers, Dagdagan, et al., 1979
Rogers, D.W.; Dagdagan, O.A.; Allinger, N.L.,
Heats of hydrogenation and formation of linear alkynes and a molecular mechanics interpretation,
J. Am. Chem. Soc., 1979, 101, 671-676. [all data]
Farchan Laboratories, 1990
Farchan Laboratories,
Research Chemicals Catalog, Farchan Laboratories, Gainesville, FL, 1990, 91. [all data]
Rang and Martinson, 1978
Rang, S.; Martinson, E.,
Ionization potentials of unsaturated hydrocarbons. 3. n-Alkyunes C8-C12.,
Eesti. NSV Tead. Akad. Toim. Keem., 1978, 44. [all data]
Soják, Farkas, et al., 1991
Soják, L.; Farkas, P.; Ostrovský, I.; Janák, J.; Chrétien, J.R.,
Capillary gas chromatography of C5 - C13 branched alkynes on squalane and liquid crystal stationary phases,
J. Chromatogr., 1991, 557, 241-253, https://doi.org/10.1016/S0021-9673(01)87136-3
. [all data]
Kuningas, Rang, et al., 1990
Kuningas, K.; Rang, S.; Kailas, T.,
Relationship between the structure and retention of n-alkenes and n-alkynes on silicone phases,
J. Chromatogr., 1990, 520, 137-148, https://doi.org/10.1016/0021-9673(90)85094-C
. [all data]
Rang, Kuningas, et al., 1976
Rang, S.; Kuningas, K.; Orav, A.; Eisen, O.,
Capillary gas chromatography of n-alkynes. I. Retention indices,
J. Chromatogr., 1976, 119, 451-460, https://doi.org/10.1016/S0021-9673(00)86807-7
. [all data]
Orav, Kuningas, et al., 1994
Orav, A.; Kuningas, K.; Kailas, T.; Koplimets, E.; Rang, S.,
Effect of adsorption on the retention values in capillary columns coated with OV-225 and PEG 20M,
J. Chromatogr. A, 1994, 659, 1, 143-150, https://doi.org/10.1016/0021-9673(94)85016-X
. [all data]
Rang, Orav, et al., 1988
Rang, S.A.; Orav, A.E.; Kuningas, K.R.; Meister, A.E.; Strense, T.V.; Eisen, O.G.,
Gas-Chromatographic Characteristics of unsaturated hydrocarbons, Academy of Sciences of Estonia SSR, Tallinn, Estonia SSR, 1988, 208. [all data]
Orav, Kuningas, et al., 1985
Orav, A.; Kuningas, K.; Rang, S.; Eisen, O.,
Capillary gas chromatography of n-tridecenes, n-tetradecenes and C10-C14 n-alkynes on polyethylene glycol 20m of different polarity,
Eesti NSV Tead. Akad. Toim. Keem., 1985, 34, 2, 105-113. [all data]