Azulene,6-phenyl-
- Formula: C16H12
- Molecular weight: 204.2665
- IUPAC Standard InChIKey: CFFGNDYYHVVKNL-UHFFFAOYSA-N
- CAS Registry Number: 23781-82-0
- Chemical structure:
View 3d structure (requires JavaScript / HTML 5) - Permanent link for this species. Use this link for bookmarking this species for future reference.

Gas phase ion energetics data

Data compiled by: Sharon G. Lias, Rhoda D. Levin, and Sherif A. Kafafi
Ionization energy determinations
IE (eV) | Method | Reference | Comment |
---|---|---|---|
7.25 | PE | Dougherty, Lewis, et al., 1980 | Vertical value |

References

Dougherty, Lewis, et al., 1980
Dougherty, D.; Lewis, J.; Nauman, R.V.; McGlynn, S.P.,
Photoelectron spectroscopy of azulenes,
J. Electron Spectrosc. Relat. Phenom., 1980, 19, 21. [all data]
Bergmann and Ikan, 1956
Bergmann, E.D.; Ikan, R.,
J. Am. Chem. Soc., 1956, 78, 1482. [all data]