Bicyclo[3.1.1]hept-2-ene-2-carboxaldehyde, 6,6-dimethyl-, (1S)-
- Formula: C10H14O
- Molecular weight: 150.2176
- IUPAC Standard InChIKey: KMRMUZKLFIEVAO-RKDXNWHRSA-N
- CAS Registry Number: 23727-16-4
- Chemical structure:
View 3d structure (requires JavaScript / HTML 5) - Stereoisomers:
- Other names: Myrtenal

Gas phase ion energetics data

Data compiled by: Henry M. Rosenstock, Keith Draxl, Bruce W. Steiner, and John T. Herron
Ionization energy determinations
IE (eV) | Method | Reference |
---|---|---|
9.36 | EI | Bunau, Schade, et al., 1967 |
Appearance energy determinations
Ion | AE (eV) | Other Products | Method | Reference | Comment |
---|---|---|---|---|---|
C9H11O+ | 10.7 | CH3 | EI | Bunau, Schade, et al., 1967 |

References

Bunau, Schade, et al., 1967
Bunau, G.v.; Schade, G.; Gollnick, K.,
Massenspektrometrische Untersuchungen von Terpenen. I.Monoterpenaldehyde und -ketone,
Z. Anal. Chem., 1967, 227, 173. [all data]