Dibenzo[b,e]stannin,5,10-dihydro-5,5-dimethyl-

Gas phase ion energetics data

Data compiled by: Sharon G. Lias, Rhoda D. Levin, and Sherif A. Kafafi

Ionization energy determinations

IE (eV) Method Reference
≤8.6EITerlouw, Heerma, et al., 1974

Appearance energy determinations

Ion AE (eV) Other Products MethodReferenceComment
C14H13Sn+9.0CH3EITerlouw, Heerma, et al., 1974

References

Terlouw, Heerma, et al., 1974
Terlouw, J.K.; Heerma, W.; Frintrop, P.C.M.; Dijkstra, G.; Meinema, H.A., Electron-impact induced fragmentation of some heterocyclic-tin compounds, J. Organomet. Chem., 1974, 64, 205. [all data]