Benzene, 1,2,3,5-tetrafluoro-
- Formula: C6H2F4
- Molecular weight: 150.0737
- IUPAC Standard InChIKey: UHHYOKRQTQBKSB-UHFFFAOYSA-N
- CAS Registry Number: 2367-82-0
- Chemical structure:
View 3d structure (requires JavaScript / HTML 5) - Other names: 1,2,3,5-Tetrafluorobenzene; 1,2,4,6-Tetrafluorobenzene; 1,3,4,5-Tetrafluorobenzene

Condensed phase thermochemistry data

Data compiled by: Eugene S. Domalski and Elizabeth D. Hearing
Quantity | Value | Units | Method | Reference | Comment |
---|---|---|---|---|---|
S°liquid | 257.3 | J/mol*K | N/A | Andon and Martin, 1973 |
Constant pressure heat capacity of liquid
Cp,liquid (J/mol*K) | Temperature (K) | Reference | Comment |
---|---|---|---|
190.3 | 298.15 | Andon and Martin, 1973 | T = 10 to 310 K. |

Phase change data

Data compiled as indicated in comments:
BS - Robert L. Brown and Stephen E. Stein
TRC - Thermodynamics Research Center, NIST Boulder Laboratories, Chris Muzny director
AC - William E. Acree, Jr., James S. Chickos
ALS - Hussein Y. Afeefy, Joel F. Liebman, and Stephen E. Stein
DH - Eugene S. Domalski and Elizabeth D. Hearing
Quantity | Value | Units | Method | Reference | Comment |
---|---|---|---|---|---|
Tboil | 356.2 | K | N/A | Weast and Grasselli, 1989 | BS |
Quantity | Value | Units | Method | Reference | Comment |
Ttriple | 226.90 | K | N/A | Andon and Martin, 1973, 2 | Crystal phase 1 phase; Uncertainty assigned by TRC = 0.02 K; TRC |
Quantity | Value | Units | Method | Reference | Comment |
Tc | 535.25 | K | N/A | Ambrose, Broderick, et al., 1974 | Uncertainty assigned by TRC = 0.2 K; TRC |
Quantity | Value | Units | Method | Reference | Comment |
Pc | 37.47 | bar | N/A | Ambrose, Broderick, et al., 1974 | Uncertainty assigned by TRC = 0.06 bar; TRC |
Quantity | Value | Units | Method | Reference | Comment |
ΔvapH° | 36.0 | kJ/mol | N/A | Boublik, Fried, et al., 1984 | Based on data from 290. to 380. K. See also Basarová and Svoboda, 1991.; AC |
ΔvapH° | 35.4 | kJ/mol | V | Findlay, 1969 | ALS |
Enthalpy of vaporization
ΔvapH (kJ/mol) | Temperature (K) | Method | Reference | Comment |
---|---|---|---|---|
32.4 | 400. | A | Stephenson and Malanowski, 1987 | Based on data from 385. to 416. K.; AC |
36.0 | 302. | A | Stephenson and Malanowski, 1987 | Based on data from 287. to 382. K. See also Ambrose, Ellender, et al., 1975 and Boublik, Fried, et al., 1984.; AC |
36.0 | 294. | MM | Stephenson and Malanowski, 1987 | Based on data from 279. to 323. K. See also Findlay, 1969, 2.; AC |
Antoine Equation Parameters
log10(P) = A − (B / (T + C))
P = vapor pressure (bar)
T = temperature (K)
View plot Requires a JavaScript / HTML 5 canvas capable browser.
Temperature (K) | A | B | C | Reference | Comment |
---|---|---|---|---|---|
279.23 to 322.98 | 4.18356 | 1281.586 | -51.20 | Findlay, 1969, 2 | Coefficents calculated by NIST from author's data. |
Enthalpy of fusion
ΔfusH (kJ/mol) | Temperature (K) | Reference | Comment |
---|---|---|---|
10.67 | 226.9 | Andon and Martin, 1973, 2 | AC |
Enthalpy of phase transition
ΔHtrs (kJ/mol) | Temperature (K) | Initial Phase | Final Phase | Reference | Comment |
---|---|---|---|---|---|
4.300 | 224.2 | crystaline, II | crystaline, I | Andon and Martin, 1973 | DH |
6.360 | 226.90 | crystaline, I | liquid | Andon and Martin, 1973 | DH |
Entropy of phase transition
ΔStrs (J/mol*K) | Temperature (K) | Initial Phase | Final Phase | Reference | Comment |
---|---|---|---|---|---|
19.2 | 224.2 | crystaline, II | crystaline, I | Andon and Martin, 1973 | DH |
28.0 | 226.90 | crystaline, I | liquid | Andon and Martin, 1973 | DH |

Reaction thermochemistry data

Data compiled as indicated in comments:
M - Michael M. Meot-Ner (Mautner) and Sharon G. Lias
B - John E. Bartmess
RCD - Robert C. Dunbar
Individual Reactions
By formula: C6H6+ + C6H2F4 = (C6H6+ • C6H2F4)
Bond type: Charge transfer bond (positive ion)
Quantity | Value | Units | Method | Reference | Comment |
---|---|---|---|---|---|
ΔrH° | 46.9 | kJ/mol | PHPMS | Meot-Ner (Mautner), Hamlet, et al., 1978 | gas phase; Entropy change calculated or estimated; M |
Quantity | Value | Units | Method | Reference | Comment |
ΔrS° | 110. | J/mol*K | N/A | Meot-Ner (Mautner), Hamlet, et al., 1978 | gas phase; Entropy change calculated or estimated; M |
Free energy of reaction
ΔrG° (kJ/mol) | T (K) | Method | Reference | Comment |
---|---|---|---|---|
13. | 300. | PHPMS | Meot-Ner (Mautner), Hamlet, et al., 1978 | gas phase; Entropy change calculated or estimated; M |
C6HF4- + =
By formula: C6HF4- + H+ = C6H2F4
Quantity | Value | Units | Method | Reference | Comment |
---|---|---|---|---|---|
ΔrH° | 1521. ± 8.8 | kJ/mol | G+TS | Buker, Nibbering, et al., 1997 | gas phase; B |
Quantity | Value | Units | Method | Reference | Comment |
ΔrG° | 1487. ± 8.4 | kJ/mol | IMRE | Buker, Nibbering, et al., 1997 | gas phase; B |
By formula: Cr+ + C6H2F4 = (Cr+ • C6H2F4)
Quantity | Value | Units | Method | Reference | Comment |
---|---|---|---|---|---|
ΔrH° | 103. | kJ/mol | RAK | Ryzhov, 1999 | RCD |
Quantity | Value | Units | Method | Reference | Comment |
ΔrS° | 5.2091×10+6 | J/mol*K | RAK | Ryzhov, 1999 | RCD |

Gas phase ion energetics data

Data evaluated as indicated in comments:
HL - Edward P. Hunter and Sharon G. Lias
L - Sharon G. Lias
Data compiled as indicated in comments:
B - John E. Bartmess
LLK - Sharon G. Lias, Rhoda D. Levin, and Sherif A. Kafafi
RDSH - Henry M. Rosenstock, Keith Draxl, Bruce W. Steiner, and John T. Herron
Quantity | Value | Units | Method | Reference | Comment |
---|---|---|---|---|---|
IE (evaluated) | 9.55 ± 0.01 | eV | N/A | N/A | L |
Quantity | Value | Units | Method | Reference | Comment |
Proton affinity (review) | 747.3 | kJ/mol | N/A | Hunter and Lias, 1998 | HL |
Quantity | Value | Units | Method | Reference | Comment |
Gas basicity | 719.6 | kJ/mol | N/A | Hunter and Lias, 1998 | HL |
Ionization energy determinations
IE (eV) | Method | Reference | Comment |
---|---|---|---|
9.531 ± 0.004 | EQ | Lias and Ausloos, 1978 | LLK |
9.55 | PI | Bralsford, Harris, et al., 1960 | RDSH |
9.56 | PE | Streets and Ceasar, 1973 | Vertical value; LLK |
De-protonation reactions
C6HF4- + =
By formula: C6HF4- + H+ = C6H2F4
Quantity | Value | Units | Method | Reference | Comment |
---|---|---|---|---|---|
ΔrH° | 1521. ± 8.8 | kJ/mol | G+TS | Buker, Nibbering, et al., 1997 | gas phase; B |
Quantity | Value | Units | Method | Reference | Comment |
ΔrG° | 1487. ± 8.4 | kJ/mol | IMRE | Buker, Nibbering, et al., 1997 | gas phase; B |

Ion clustering data

Data compiled as indicated in comments:
M - Michael M. Meot-Ner (Mautner) and Sharon G. Lias
RCD - Robert C. Dunbar
Clustering reactions
By formula: C6H6+ + C6H2F4 = (C6H6+ • C6H2F4)
Bond type: Charge transfer bond (positive ion)
Quantity | Value | Units | Method | Reference | Comment |
---|---|---|---|---|---|
ΔrH° | 46.9 | kJ/mol | PHPMS | Meot-Ner (Mautner), Hamlet, et al., 1978 | gas phase; Entropy change calculated or estimated; M |
Quantity | Value | Units | Method | Reference | Comment |
ΔrS° | 110. | J/mol*K | N/A | Meot-Ner (Mautner), Hamlet, et al., 1978 | gas phase; Entropy change calculated or estimated; M |
Free energy of reaction
ΔrG° (kJ/mol) | T (K) | Method | Reference | Comment |
---|---|---|---|---|
13. | 300. | PHPMS | Meot-Ner (Mautner), Hamlet, et al., 1978 | gas phase; Entropy change calculated or estimated; M |
By formula: Cr+ + C6H2F4 = (Cr+ • C6H2F4)
Quantity | Value | Units | Method | Reference | Comment |
---|---|---|---|---|---|
ΔrH° | 103. | kJ/mol | RAK | Ryzhov, 1999 | RCD |
Quantity | Value | Units | Method | Reference | Comment |
ΔrS° | 5.2091×10+6 | J/mol*K | RAK | Ryzhov, 1999 | RCD |

References

Andon and Martin, 1973
Andon, R.J.L.; Martin, J.F.,
Thermodynamic properties of fluorine compounds. Part 11. Low-temperature heat capacities of the three tetrafluorobenzenes,
J. Chem. Soc. Faraday Trans., 1973, I 69, 761-770. [all data]
Weast and Grasselli, 1989
CRC Handbook of Data on Organic Compounds, 2nd Editon, Weast,R.C and Grasselli, J.G., ed(s)., CRC Press, Inc., Boca Raton, FL, 1989, 1. [all data]
Andon and Martin, 1973, 2
Andon, R.J.L.; Martin, J.F.,
Thermodynamic properties of fluorine compounds. Part 11.---Low-temperature heat capacities of the three tetrafluorobenzenes,
J. Chem. Soc., Faraday Trans. 1, 1973, 69, 0, 761, https://doi.org/10.1039/f19736900761
. [all data]
Ambrose, Broderick, et al., 1974
Ambrose, D.; Broderick, B.E.; Townsend, R.,
The Critical Temperatures and Pressures of Thirty Organic Compounds,
J. Appl. Chem. Biotechnol., 1974, 24, 359. [all data]
Boublik, Fried, et al., 1984
Boublik, T.; Fried, V.; Hala, E.,
The Vapour Pressures of Pure Substances: Selected Values of the Temperature Dependence of the Vapour Pressures of Some Pure Substances in the Normal and Low Pressure Region, 2nd ed., Elsevier, New York, 1984, 972. [all data]
Basarová and Svoboda, 1991
Basarová, Pavlína; Svoboda, Václav,
Calculation of heats of vaporization of halogenated hydrocarbons from saturated vapour pressure data,
Fluid Phase Equilibria, 1991, 68, 13-34, https://doi.org/10.1016/0378-3812(91)85008-I
. [all data]
Findlay, 1969
Findlay, T.J.V.,
Vapor pressures of fluorobenzenes from 5° to 50°C,
J. Chem. Eng. Data, 1969, 14, 229. [all data]
Stephenson and Malanowski, 1987
Stephenson, Richard M.; Malanowski, Stanislaw,
Handbook of the Thermodynamics of Organic Compounds, 1987, https://doi.org/10.1007/978-94-009-3173-2
. [all data]
Ambrose, Ellender, et al., 1975
Ambrose, D.; Ellender, J.H.; Sprake, C.H.S.; Townsend, R.,
Thermodynamic properties of fluorine compounds. Part 15.---Vapour pressures of the three tetrafluorobenzenes and 1,3,5-trichloro-2,4,6-trifluorobenzene,
J. Chem. Soc., Faraday Trans. 1, 1975, 71, 0, 35, https://doi.org/10.1039/f19757100035
. [all data]
Findlay, 1969, 2
Findlay, T.J.V.,
Vapor pressures of fluorobenzenes from 5 to 50.deg.C,
J. Chem. Eng. Data, 1969, 14, 2, 229-231, https://doi.org/10.1021/je60041a012
. [all data]
Meot-Ner (Mautner), Hamlet, et al., 1978
Meot-Ner (Mautner), M.; Hamlet, P.; Hunter, E.P.; Field, F.H.,
Bonding Energies in Association Ions of Aromatic Molecules. Correlations with Ionization Energies,
J. Am. Chem. Soc., 1978, 100, 17, 5466, https://doi.org/10.1021/ja00485a034
. [all data]
Buker, Nibbering, et al., 1997
Buker, H.H.; Nibbering, N.M.M.; Espinosa, D.; Mongin, F.; Schlosser, M.,
Additivity of substituent effects in the fluoroarene series: Equilibrium acidity in the gas phase and deprotonation rates in ethereal solution,
Tetrahed. Lett., 1997, 38, 49, 8519-8522, https://doi.org/10.1016/S0040-4039(97)10303-3
. [all data]
Ryzhov, 1999
Ryzhov, V.,
Binding Energies of Chromium Cations with Fluorobenzenes from Radiative Association Kinetics,
Int. J. Mass Spectrom., 1999, 185/186/187, 913. [all data]
Hunter and Lias, 1998
Hunter, E.P.; Lias, S.G.,
Evaluated Gas Phase Basicities and Proton Affinities of Molecules: An Update,
J. Phys. Chem. Ref. Data, 1998, 27, 3, 413-656, https://doi.org/10.1063/1.556018
. [all data]
Lias and Ausloos, 1978
Lias, S.G.; Ausloos, P.J.,
eIonization energies of organic compounds by equilibrium measurements,
J. Am. Chem. Soc., 1978, 100, 6027. [all data]
Bralsford, Harris, et al., 1960
Bralsford, R.; Harris, P.V.; Price, W.C.,
The effect of fluorine on the electronic spectra and ionization potentials of molecules,
Proc. Roy. Soc. (London), 1960, A258, 459. [all data]
Streets and Ceasar, 1973
Streets, D.G.; Ceasar, G.P.,
Inductive mesomeric effects on the π orbitals of halobenzenes,
Mol. Phys., 1973, 26, 1037. [all data]
Gilbert, et al., 1972
Gilbert, R., et al.,
Can. J. Chem., 1972, 50, 543. [all data]