Ethene, 1-bromo-2-fluoro-, (Z)-
- Formula: C2H2BrF
- Molecular weight: 124.940
- IUPAC Standard InChIKey: JNODEIRSLUOUMY-UPHRSURJSA-N
- CAS Registry Number: 2366-31-6
- Chemical structure:
View 3d structure (requires JavaScript / HTML 5) - Permanent link for this species. Use this link for bookmarking this species for future reference.

Gas phase ion energetics data

Data compiled by: Sharon G. Lias, Rhoda D. Levin, and Sherif A. Kafafi
Ionization energy determinations
IE (eV) | Method | Reference | Comment |
---|---|---|---|
9.75 | PE | Wittel and Bock, 1974 | Vertical value |

References

Wittel and Bock, 1974
Wittel, K.; Bock, H.,
Photoelektronenspekten und molekuleigenschaften. XXVII. Chlor- und bromathylene- beispiele fur anderungen in π- und σ-Systemen,
Chem. Ber., 1974, 107, 317. [all data]