1H-Benzotriazole, 1-(benzylideneamino)-
- Formula: C13H10N4
- Molecular weight: 222.2453
- IUPAC Standard InChIKey: KSFYLQMDWMTUSD-UHFFFAOYSA-N
- CAS Registry Number: 23589-43-7
- Chemical structure:
View 3d structure (requires JavaScript / HTML 5) - Other names: N-[Phenylmethylidene]-1H-1,2,3-benzotriazol-1-amine; 1-Benzylideneamino-1,2,3-benzotriazole

Gas phase ion energetics data

Data compiled by: Henry M. Rosenstock, Keith Draxl, Bruce W. Steiner, and John T. Herron
Appearance energy determinations
Ion | AE (eV) | Other Products | Method | Reference | Comment |
---|---|---|---|---|---|
C13H9+ | 9.6 ± 0.1 | ? | EI | Rapp, Staab, et al., 1970 |

References

Rapp, Staab, et al., 1970
Rapp, U.; Staab, H.A.; Wunsche, C.,
Skelettumlagerungen unter Elektronenbeschuss-IV: zur Struktur der C13H9- und C12H9N-Ionen bei Benzylidenaminobenztriazolen,
Org. Mass Spectrom., 1970, 3, 45. [all data]