4-t-Butyl pyridine, 1-oxide
- Formula: C9H13NO
- Molecular weight: 151.2056
- IUPAC Standard InChIKey: CMFQXPIZAKBRCG-UHFFFAOYSA-N
- CAS Registry Number: 23569-17-7
- Chemical structure:
View 3d structure (requires JavaScript / HTML 5) - Other names: Pyridine,4-(1,1-dimethylethyl)-,1-oxide; 4-t-Butylpyridine-N-oxide

Gas phase ion energetics data

Data compiled as indicated in comments:
LLK - Sharon G. Lias, Rhoda D. Levin, and Sherif A. Kafafi
Ionization energy determinations
IE (eV) | Method | Reference | Comment |
---|---|---|---|
7.8 | PE | Weiner and Lattman, 1974 | LLK |
8.00 | PE | Weiner and Lattman, 1974 | Vertical value; LLK |

References

Weiner and Lattman, 1974
Weiner, M.A.; Lattman, M.,
Photoelectron spectra of 4-substituted pyridine N-oxides,
Tetrahedron Lett., 1974, 1709. [all data]